1560424981545:osgi:list | grep hawtio
1560425077964:features:list
1560425089527:features:list | grep hawtio
1560425122015:features:install jolokia
1560428838174:exit
1560429003730:osgi:list
1560429015545:start 227
1560429018164:osgi:list
1560429065325:features:list | grep camel
1560429110057:features:install camel-jackson
1561117961761:list
1561118005346:osgi:resolve 229
1561118031411:osgi:start 229
1561118254269:feature:install camel-jakson
1561118279038:feature
1561118288638:feature:
1561118304127:featue:list
1561118323968:feature:list
1561118345869:C
1561118363444:list
1561118385761:cccxx
1561118386036:X
1561118386338:x
1561118415172:feature:list
1561118437150:osgi:intall 229
1561118472289:osgi:start 229
1561118537638:list
1561118997645:features:list
1561119007901:features:list | grep jakson
1561119022532:features:list | grep jackson
1561119035355:lsit
1561119040891:list
1561119052512:osgi:start 229
1561119324110:features:list | grep common
1561119673139:list
1561119683310:osgi:start 229
1561361626043:list
1561361719431:osgi:start 229
1561367580608:list
1561367621611:mvn:commons-io/commons-io/2.5.0.redhat-3
1561368068183:feature:install common-io
1561368075907:mvn:commons-io/commons-io/2.5.0.redhat-3
1561369183323:stop
1561369370336:list
1561369386889:osgi:install 229`
1561369389364:osgi:install 229
1561369403624:osgi:start 229
1561369507848:mvn:commons-io/commons-io/2.5.0.redhat-3
1561369988002:list
1561370022834:mvn:commons-io/commons-io/2.5.0.redhat-3
1561373698803:list
1561373708555:osgi:install -s mvn:commons-io/commons-io/2.5.0.redhat-3
1561373718582:list
1561373736432:osgi:start 229
1561374775192:list
1561374787944:osgi:start 229
1561374887977:list
1561374897421:osgi:229
1561374905513:osgi:start 229
1561377797845:list
1561377895431:osgi:start 229
1561379215717:osgi:install -s mvn:commons-lang/commons-lang/2.6.0.redhat-7
1561379220181:osgi:start 229
1561379226067:list
1561381033034:exit
1561381038135:eixt
1561381039726:exit
1561455196799:list
1561455205845:la -s
1561455722925:list
1561462198835:la -s
1561462328163:list
1561484946111:quit
1561484947739:exit
1561484950898:shutdown
1561485096365:osgi:list
1561485155280:quit
1561485156727:exit
1561485169958:?
1561485190544:osgi:list
1561485284266:osgi:list all
1561485287704:osgi:list
1561485338066:sh
1561485341705:shutdown
1561485558296:quit
1561485558531:ls
1561485562224:quit
1561485563192:ls
1561485565395:exit
1561485569483:?
1561485586090:osgi:list
1561618747362:wrap:file:/opt/jboss-fuse/deploy/tomcat-util-8.0.0-RC1.jar$Bundle-SymbolicName=tomcat-util&Bundle-Version=8.0.0.RC1
1561618824630:list
1561618846830:osgi:start 228
1561618952564:osgi:start 229
1561618956499:list
1561618975061:osgi:start 228
1561619272342:osgi:install -s mvn:commons-io/commons-io/2.5.0.redhat-3
1561619281910:list
1561619313796:osgi:start 228
1561619339657:osgi:install -s mvn:commons-lang/commons-lang/2.6.0.redhat-7
1561619350235:list
1561619363146:osgi:start 228
1561619402121:osgi:start 229
1561619405784:list
1561619446910:osgi:start 228
1561619557355:osgi:start 229
1561619563816:list
1561619576158:osgi:start 228
1561619767235:list
1561619792743:osgi:start 228
1561619795190:list
1561620051474:osgi:start 229
1561620065762:osgi:start 228
1561621485753:osgi:start 229
1561621648920:osgi:start 228
1561623250608:wrap:file:/opt/jboss-fuse/deploy/tomcat-util-8.0.0-RC1.jar$Bundle-SymbolicName=tomcat-util&Bundle-Version=8.0.0.RC1
1561623260551:osgi:start 228
1561623273351:unwrap:file:/opt/jboss-fuse/deploy/tomcat-util-8.0.0-RC1.jar$Bundle-SymbolicName=tomcat-util&Bundle-Version=8.0.0.RC1
1561623279210:osgi:start 228
1561623298769:list
1561626854675:osgi:start 228
1561630400978:list
1561630430382:osgi:start 228
1561634119679:list
1561719469631:osgi:list
1561719716542:exit
1561719730074:exit()
1561719732362:exit
1561719902701::q
1561719904765:ll
1561719907967:;;
1561719910441:;
1561719915350:exit
1561963517143:list
1561963568601:osgi:start 228
1561963673753:list
1561963687240:osgi:start 228
1561963690516:list
1561963880090:osgi:start 229
1561963882630:list
1561963894183:osgi:start 228
1561963906088:list
1561963932086:osgi:start 228
1561963949088:osgi:start 229
1561963959021:list
1561968933249:feature:list
1561969024639:osgi:list
1561969136772:start 252
1561969139590:osgi:list
1561969155476:install 252
1561969720384:osgi:list
1561969727291:install 252
1561969759171:start 251
1561969762275:start 252
1561969766504:osgi:list
1561969771817:resolve 252
1561970009721:osgi:list
1561970024222:bundle:start 252
1561970027100:osgi:list
1561970039754:bundle:install 252
1561970779018:osgi:list
1561970854916:exit
1561970920106:osgi:list
1561970991812:features:install camel-jackson
1561971015339:osgi:list
1561976685974:list
1561976784560:osgi:start 259
1561976896332:list
1561976900254:osgi:start 259
1561977033531:list
1561977037649:osgi:start 259
1561977081707:list
1561977084448:osgi:start 259
1561977127031:list
1561978706949:osgi:start 259
1562047924334:list
1562047942264:osgi:start 259
1562048080578:list
1562049288807:osgi:start 265
1562049354816:list
1562049361654:osgi:start 265
1562049751066:list
1562049981838:http://115.186.58.39:8181/cxf
1562050139077:list
1562051699113:osgi:start 267
1562052541160:list
1562052559813:osgi:start 267
1562052592000:list
1562052618198:osgi:start 267
1562053615247:ls -a
1562053619887:la -s
1562054172403:osgi:start 267
1562057792903:install -s mvn:org.apache.geronimo.specs/geronimo-jms_1.1_spec/1.1.1
1562057801315:list
1562057819497:osgi:start 267
1562057860133:feature:install
1562057896704:feature:install activemq-client
1562057912328:list
1562060057615:osgi:start 267
1562060136037:osgi:start 275
1562060293872:list
1562060343120:osgi:start 267
1562060512363:osgi:stop 268
1562060516660:list
1562060542290:osgi:start 267
1562060553727:osgi:start 275
1562060564074:osgi:start 268
1562060567895:list
1562060618854:osgi:start 267
1562060689048:list
1562060874120:osgi:start 267
1562061101408:list
1562061118124:osgi:start 267
1562061126938:osgi:start 278
1562062826850:osgi:start 267
1562063592870:feature:uninstall activemq-client
1562063607144:osgi:start 267
1562063613768:lsit
1562063616872:list
1562063632242:osgi:start 278
1562063991780:feature:install activemq-client
1562063999702:list
1562064048812:osgi:start 278
1562064080089:list
1562064171084:osgi:start 278
1562064177638:osgi:start 267
1562064287450:feature:uninstall activemq-client
1562064293891:osgi:start 267
1562064301454:feature:install activemq-client
1562064310537:list
1562064389599:feature:list
1562064620354:list
1562064640284:osgi:start 278
1562064686885:osgi:stop 268
1562064690112:list
1562064725115:osgi:start 267
1562064739676:osgi:uninstall 267
1562064743245:list
1562064791371:osgi:install 267
1562064798829:list
1562064842191:osgi:start 268
1562064844219:list
1562064853759:osgi:start 267
1562064883658:list
1562064905036:osgi:start 290
1562065012279:osgi:uninstall 268
1562065016652:list
1562065031803:osgi:start 290
1562065059793:osgi:start 278
1562065083968:install -s mvn:org.apache.geronimo.specs/geronimo-jms_1.1_spec/1.1.1
1562065087687:osgi:start 278
1562065095047:list
1562065114987:osgi:start 290
1562065147345:install -s mvn:org.apache.geronimo.specs/geronimo-jms_1.1_spec/2.0.0
1562065163907:osgi:start 290
1562065183925:list
1562065193642:osgi:start 290
1562065343865:list
1562065361800:osgi:start 290
1562065886285:install -s mvn:org.apache.geronimo.specs/geronimo-jms_1.1_spec/1.1.1
1562065889833:osgi:start 290
1562065922254:list
1562066090713:sh stop
1562066369857:list
1562066411558:osgi:start 394
1562066416346:osgi:start 294
1562066455881:feature:install
1562066462621:feature:install a
1562066565353:list
1562066611435:osgi:uninstall 287
1562066614909:list
1562066650410:osgi:start 301
1562066690168:osgi:start 288
1562066723230:install -s mvn:org.apache.geronimo.specs/geronimo-jms_1.1_spec/1.1.1
1562066727577:list
1562066745794:osgi:start 288
1562066765416:feature:uninstall activemq-client
1562066774274:list
1562066788228:osgi:start 301
1562066810235:feature:install activemq-client
1562066818806:list
1562066834456:osgi:start 301
1562066858600:list
1562066863487:osgi:start 307
1562066912604:list
1562066931013:osgi:start 307
1562066935933:list
1562066977776:osgi:start 307
1562066982751:osgi:start 301
1562068310417:osgi:uninstall 301
1562068315530:list
1562068455095:exports| grep javax.jms
1562068494593:list
1562068526718:osgi:install 301
1562068562975:list
1562068596079:osgi:start 310
1562068639678:headers 310
1562068831870:list
1562069198634:install -s file:/home/shahid.farooq/phoenix-esb-jumo-1.1.1-SNAPSHOT.jar
1562069245412:exports| grep javax.jms
1562069483949:list
1562069496831:osgi:uninstall 311
1562069526646:install -s file:/home/shahid.farooq/phoenix-esb-jumo-1.1.1-SNAPSHOT.jar
1562069534160:list
1562069647273:osgi:uninstall 291
1562069650996:list
1562069661355:osgi:start 307
1562072381691:list
