{
  "WooCommerce": {
    "url": "http://dev80.onlinetestingserver.com/wp/",
    "consumerKey": "ck_b6012a1db2b289e44f0e08aeb16625940435d5b9",
    "consumerSecret": "cs_7ff7ae186e82919aa642ac7491acd95ecb5a2a2e"
  },
  "HorizonLayout": [
    {
      "layout": "mainCategory"
    },
    {
      "layout": "circleCategory"
    },
    // {
    //   "layout": "bannerHigh",
    //   "categoryOrTag": 273,
    //   "tag": 273
    // },
    {
      "layout": "bannerImage",
      "categoryOrTag": 105,
      "name": "Top Selling",
      "imageBanner": "https://dev80.onlinetestingserver.com/wp/wp-content/uploads/2019/11/top_selling_banner@3x.png",
      "category": 105,
      "height":150
    },
    {
      "name": "flashSale",
      "image": "",
      "layout": "threeColumn",
      "categoryOrTag": 106,
      "category": 106
    },
    {
      "layout": "bannerImage",
      "name": "Limited Sale",
      "categoryOrTag": 107,
      "imageBanner": "https://dev80.onlinetestingserver.com/wp/wp-content/uploads/2019/11/sale_banner@3x.png",
      "category": 107,
      "height":160
    },
    {
      "name": "mostPopular",
      "image": "",
      "layout": "threeColumn",
      "categoryOrTag": 108,
      "category": 108
    },
    // {
    //   "name": "News",
    //   "layout": "Blog",
    //   "categoryOrTag": 21,
    //   "tag": 21
    // }
  ],
  "MainColor": "#000"
}