# Define X count and Y count
9:9
# - No Tile
# Generic Tile
# o - Kingdom Spawn
# h - Home
- - x x x x - x x
- x o x x x x o x
- - x x x x x x x
- - x x - x x x -
- - x x x h x x x
- - x x x - x x -
- - x x x x x x -
- - x o x x x - -
- - - x x - - - -