{
    "type": "array",
    "title": "Projektionswege",
    "items": {
        "title": "Projektionsweg Segment",
        "headerTemplate": "{{self.vhIst}} - {{self.wgIst}}",
        "type": "object",
        "format": "grid",
        "properties": {
            "vhIst": {
                "propertyOrder": 1,
                "title": "Vegetationshöhenstufe Ist",
                "type": "string",
                "description": "Vegetationshöhenstufe vor Veränderung",
                "enum": [
                    "obersubalpin",
                    "subalpin",
                    "hochmontan",
                    "obermontan",
                    "ober und untermontan",
                    "untermontan",
                    "submontan",
                    "collin",
                    "collin mit buche",
                    "hyperinsubrisch",
                    "collin - mediterran"
                ]
            },
            "wgIst": {
                "propertyOrder": 2,
                "title": "Waldgesellschaft Ist",
                "type": "string",
                "description": "Waldgesellschaft vor Veränderung",
                "enum": [
                    "1" , "1h" , "2" , "3" , "3a" , "3LV" , "3L/4L" , "3*" , "4" , "4*" , "6" , "6Fe" , "7S" , "7SFe" , "7a" , "7aFe" , "7*" , "8S" , "8SFe" , "8a" , "8aFe" , "8d" , "8dFe" , "8*" , "9a" ,"9a c" , "9aFe" , "9w" , "10a" , "10w" , "11" , "11Fe" , "12*" , "12S" , "12SFe" , "12a" , "12aFe" , "12e" , "12*h" , "12w" , "13a" , "13aFe" , "13e" , "13eh" , "13h" , "13hFe" , "13*" , "14" , "14*" , "15" , "16" , "16*" , "17" , "18" , "18Fe" , "18M" , "18w" , "18v" , "18*" , "19" , "19Fe" , "19L" , "19P" , "19a" , "19f" , "20" , "20E" , "21" , "21L" , "21*" , "22" , "22Fe" , "22A" , "22C" , "22*" , "23" , "23Fe" , "23H" , "23*" , "24*" , "24*Fe" , "25" , "25Fe" , "25A" , "25Q" , "25O" , "25a" , "25as" , "25b" , "25e" , "25f" , "25au" , "25*" , "26" , "26h" , "26w" , "27" , "27O" , "27h" , "27*" , "28" , "29" , "29A" , "29C" , "29h" , "30" , "31" , "32C" , "32S" , "32V" , "32*" , "33a" , "33b" , "33m" , "33V" , "34a" , "34b" , "34*" , "35" , "35M" , "35Q" , "35S" , "35A" , "36" , "37" , "38" , "38S" , "38*" , "39" , "39*" , "40P" , "40PBl" , "40*" , "41" , "41*" , "42C" , "42Q" , "42V" , "42r" , "42B" , "42t" , "43" , "43S" , "43*" , "44" , "45" , "46" , "46M" , "46t" , "46*" , "47" , "47D" , "47M" , "47H" , "47*" , "48" , "49" , "49*" , "50" , "50Fe" , "50P" , "50*" , "51" , "51Fe" , "51C" , "52" , "52T" , "53" , "53Lä" , "53Ta" , "53A" , "53*" , "53*Ta" , "54" , "54A" , "55" , "55*" , "55*Ta" , "56" , "57Bl" , "57BlTa" , "57C" , "57CTa" , "57M" , "57S" , "57STa" , "57V" , "57Vta" , "57VM" , "58" , "58Lä" , "58Bl" , "58C" , "58L" , "59" , "59Lä" , "59A" , "59C" , "59E" , "59J" , "59L" , "59S" , "59V" , "59H" , "59R" , "59*" , "60" , "60Lä" , "60Ta" , "60A" , "60ALä" , "60ATa" , "60E" , "60ETa" , "60*" , "60*Lä" , "60*Ta" , "61" , "62" , "65" , "65*" , "66" , "66PM" , "67" , "68" , "68*" , "69" , "70" , "71" , "72" , "72Lä" , "91" , "92a" , "92z" , "93" , "AV"                 ]
            },
            "incl": {
                "propertyOrder": 6,
                "title": "Hangneigung",
                "type": "integer",
                "description": "Wert 0-100%. Ab diesem Threshold ist die neue Vegetationshöhe gültig.",
                "default": 0,
                "minimum": 0,
                "maximum": 100
            },
            "region": { 
                "propertyOrder": 5,
                "title": "Standortsregion",
                "type": "object",
                "description": "Gültig für folgende Standortsregionen:",
                "format": "select",
                "required": ["J", "M", "1", "2a", "2b", "3", "4", "5"],
                "properties": {
                    "J": {
                        "propertyOrder": 1,
                        "type": "boolean",
                        "format": "checkbox"
                    },
                    "M": {
                        "propertyOrder": 2,
                        "type": "boolean",
                        "format": "checkbox"
                    },
                    "1": {
                        "propertyOrder": 3,
                        "type": "boolean",
                        "format": "checkbox"
                    },
                    "2a": {
                        "propertyOrder": 4,
                        "type": "boolean",
                        "format": "checkbox"
                    },
                    "2b": {
                        "propertyOrder": 5,
                        "type": "boolean",
                        "format": "checkbox"
                    },
                    "3": {
                        "propertyOrder": 6,
                        "type": "boolean",
                        "format": "checkbox"
                    },
                    "4": {
                        "propertyOrder": 7,
                        "type": "boolean",
                        "format": "checkbox"
                    },
                    "5": {
                        "propertyOrder": 8,
                        "type": "boolean",
                        "format": "checkbox"
                    }
                },
                "defaultProperties": ["J", "M", "1", "2a", "2b", "3", "4", "5"]
            },
            "misc": { 
                "propertyOrder": 7,
                "title": "Weitere Bedingungen",
                "type": "object",
                "format": "grid",
                "required": ["fir", "relief", "weitere"],
                "properties": {
                    "fir": {
                        "title": "Tannenareal",
                        "type": "string",
                        "description": "blablabla",
                        "default": "false",
                        "enum": [
                            "false",
                            "Reliktareal",
                            "Haupt- oder Nebenareal"
                        ]
                    },
                    "relief": {
                        "title": "Relief",
                        "type": "string",
                        "description": "Relief am konkreten Standpunkt",
                        "default": "false",
                        "enum": [
                            "false",
                            "Kuppenlage",
                            "Hang- oder Muldenlage"
                        ]
                    },
                    "weitere": {
                        "title": "Weitere",
                        "type": "string",
                        "description": "Weitere Bedingungen",
                        "default": "false",
                        "enum": [
                            "false",
                            "normal",
                            "Boden verdichtet",
                            "schattig, kühl, grosse Blöcke",
                            "schattig, tiefgründiger Boden",
                            "trocken, kühl, extrem Blockig",
                            "bis alle 5 Jahre überschwemmt",
                            "alle 6 Jahre oder seltener überschwemmt",
                            "min. alle 10 Jahre überschwemmt",
                            "jährlich überschwemmt"
                        ]
                    }
                }
            },
            "vhNeu": {
                "propertyOrder": 3,
                "title": "Vegetationshöhenstufe Neu",
                "type": "string",
                "description": "Vegetationshöhenstufe Neu",
                "enum": [
                    "obersubalpin",
                    "subalpin",
                    "hochmontan",
                    "obermontan",
                    "ober und untermontan",
                    "untermontan",
                    "submontan",
                    "collin",
                    "collin mit buche",
                    "hyperinsubrisch",
                    "collin - mediterran"
                    ]
            },
            "wgNeu": {
                "propertyOrder": 4,
                "title": "Waldgesellschaft Neu",
                "type": "string",
                "description": "Waldgesellschaft Neu",
                "enum": [
                    "1" , "1h" , "2" , "3" , "3a" , "3LV" , "3L/4L" , "3*" , "4" , "4*" , "6" , "6Fe" , "7S" , "7SFe" , "7a" , "7aFe" , "7*" , "8S" , "8SFe" , "8a" , "8aFe" , "8d" , "8dFe" , "8*" , "9a" ,"9a c" , "9aFe" , "9w" , "10a" , "10w" , "11" , "11Fe" , "12*" , "12S" , "12SFe" , "12a" , "12aFe" , "12e" , "12*h" , "12w" , "13a" , "13aFe" , "13e" , "13eh" , "13h" , "13hFe" , "13*" , "14" , "14*" , "15" , "16" , "16*" , "17" , "18" , "18Fe" , "18M" , "18w" , "18v" , "18*" , "19" , "19Fe" , "19L" , "19P" , "19a" , "19f" , "20" , "20E" , "21" , "21L" , "21*" , "22" , "22Fe" , "22A" , "22C" , "22*" , "23" , "23Fe" , "23H" , "23*" , "24*" , "24*Fe" , "25" , "25Fe" , "25A" , "25Q" , "25O" , "25a" , "25as" , "25b" , "25e" , "25f" , "25au" , "25*" , "26" , "26h" , "26w" , "27" , "27O" , "27h" , "27*" , "28" , "29" , "29A" , "29C" , "29h" , "30" , "31" , "32C" , "32S" , "32V" , "32*" , "33a" , "33b" , "33m" , "33V" , "34a" , "34b" , "34*" , "35" , "35M" , "35Q" , "35S" , "35A" , "36" , "37" , "38" , "38S" , "38*" , "39" , "39*" , "40P" , "40PBl" , "40*" , "41" , "41*" , "42C" , "42Q" , "42V" , "42r" , "42B" , "42t" , "43" , "43S" , "43*" , "44" , "45" , "46" , "46M" , "46t" , "46*" , "47" , "47D" , "47M" , "47H" , "47*" , "48" , "49" , "49*" , "50" , "50Fe" , "50P" , "50*" , "51" , "51Fe" , "51C" , "52" , "52T" , "53" , "53Lä" , "53Ta" , "53A" , "53*" , "53*Ta" , "54" , "54A" , "55" , "55*" , "55*Ta" , "56" , "57Bl" , "57BlTa" , "57C" , "57CTa" , "57M" , "57S" , "57STa" , "57V" , "57Vta" , "57VM" , "58" , "58Lä" , "58Bl" , "58C" , "58L" , "59" , "59Lä" , "59A" , "59C" , "59E" , "59J" , "59L" , "59S" , "59V" , "59H" , "59R" , "59*" , "60" , "60Lä" , "60Ta" , "60A" , "60ALä" , "60ATa" , "60E" , "60ETa" , "60*" , "60*Lä" , "60*Ta" , "61" , "62" , "65" , "65*" , "66" , "66PM" , "67" , "68" , "68*" , "69" , "70" , "71" , "72" , "72Lä" , "91" , "92a" , "92z" , "93" , "AV" 
                ]
            }
        }
    }
                    
}