%^Bu234r$u4ng ka8k7$$!at6ua h3i4n@@@gga60p di j13en@@@@!!!d4ela
N1e3n5ek s7ud*$^a9h t()(u@#a g!#gi#$$ny$%%a t$$i@#ng#@ga%l d#$ua
(Ha)2*&nya t2e%^r2da2%^pa@#$%t sa%$4tu@!@! c$%4a4r$$##a u}}{n4tu6\\k <m<e2nye2la$$@#35m^&atk2!@an s8ek10o%l$$a^h12mu
$$K%%a##m!!u4 h@!%ar8$#us $$%be^#$r1ju3an99$g$ b!@#ers888a%%$ma se^^*&2m2%%ua t%!@#e!ma22nm@u
To$%!pi &*sa&ya& b$%un^7da7r %^bu6nd^a6r 5$%to3^p1:''i3 sa$%1y3a1
#$K8al:"au< t:"':id>?a<#k b!!!u@@nd%ar b#$~uk++a$%n t*&^&**op)(i s#$!aya1
%$C^&ari(*l":}ah {@!!or#$%@a$~!ng o@#$~!ra&*+()_n@$g y&$%^a&ng m)(&au m^$en^$j^$ad*&i $$%sch%o%%#ol!@# i#%dol
%^^As$46do$$@#s ya7ng bi2ki1n so6al ^&^%b8u99ka%%!12n w10ib%%#$1u w%%^eh
%Ik%1ut%i2413l%a@h @k@om!6pe2t$i32s$i n$$as#$%io$n0al$ ya#$n0g !@#terk0e$@nal$ :">it8u
Maka niscaya banyak orang akan berminat masuk sekolahmu2