id;jenis;metode
1;Solutions quantifying Lao People's Democratic Republic;PCI
2;Credit Card Account transmitter networks;deposit Avon hacking
3;Bypass hub;FTP Data
4;Jewelery workforce;Books De-engineered Dominican Republic
5;withdrawal Tennessee Virginia;copy communities
6;Iceland Krona Fish;Mobility Regional IB
7;TCP Towels Personal Loan Account;Tools maximize Synergistic
8;Robust;invoice purple indigo
9;mobile;dot-com convergence
10;generate;toolset
