id;date;order_notaris;order_notaris_success;akta;akta_cancel;akta_not_reg;akta_success;sertifikat_pending;sertifikat_success;lapiran_object;buktilunas;tgl_invoice
1;2022-12-01;32217;input synthesize Orchestrator;Marks salmon;2022-12-01T05:27:50;77186;49140;50210;44495;39702;48734;2022-12-01
2;2022-12-01;96360;virtual HDD;Outdoors Investment synergize;2022-12-01T06:04:26;73814;70320;61533;47723;55341;81431;2022-12-01
3;2022-12-02;41371;Wooden Virginia Finland;Jewelery;2022-12-02T00:34:35;38593;84224;19200;67523;26851;95082;2022-12-01
4;2022-12-01;59271;Awesome initiative tan;Gorgeous proactive;2022-12-02T01:45:48;45796;68369;36493;79375;89583;73672;2022-12-02
5;2022-12-01;82587;Health Dam Shoes;application connecting Pizza;2022-12-01T17:36:59;56299;75741;54946;95284;62347;81276;2022-12-01
6;2022-12-01;14750;multi-state Cambridgeshire;state Rustic;2022-12-01T16:39:37;6092;99117;28712;73213;96848;33363;2022-12-01
7;2022-12-01;16690;Personal;Granite Bacon Tasty;2022-12-01T23:15:13;11686;18730;35275;98677;47805;31861;2022-12-01
8;2022-12-01;19912;Denar;tertiary ivory;2022-12-01T04:00:37;99239;83272;20391;63683;69634;92559;2022-12-01
9;2022-12-01;86733;bypassing;Assistant Mexico;2022-12-02T01:42:24;77923;93717;42018;38696;33075;32249;2022-12-01
10;2022-12-01;61390;24/7;Frozen payment;2022-12-01T08:19:49;29204;56861;1937;87239;89018;26243;2022-12-01
