id;titel;nama;komparisi;tts;record_status;update_by;update_on
1;carriage;yuck queasily whether;um;reindeer amount victoriously;20566;slowly;2023-12-14T02:42:55
2;tell bashfully;serve reprimand;range instantly sweets;statute ick worth;9226;liver who;2023-12-14T08:27:58
3;occupy phew mmm;where stiff savings;demonstrate subtle;doubtfully;7759;scope photograph;2023-12-14T13:30:05
4;valentine;sight what;hmph;hmph unite advanced;7711;organizing woot;2023-12-14T07:49:28
5;dart;hidden hose;convalesce powerful absent;till psst loosely;31252;detailed all;2023-12-14T02:43:42
6;instructor cornerstone giant;dissipate viciously tuber;construction across;oof babble uh-huh;3218;save possibility which;2023-12-14T12:46:30
7;monthly wiry geez;below apse;hmph whether;brightly modulo circa;22709;mmm sympathetic;2023-12-14T08:13:09
8;deadly;harmonize;goggle self-reliant wee;yahoo lighting;11019;ick dig anti;2023-12-14T21:18:47
9;amid puzzled;upside-down;justly astride;barring methodology assure;14743;consistency or irritating;2023-12-14T12:03:27
10;drat dole;youthful meh;offensively wonderfully percolate;finally poignance following;19888;blah;2023-12-14T14:40:23
