{
  "annotations": {
    "changelogDate": "20231215021310"
  },
  "applications": "*",
  "entityTableName": "invoice",
  "fields": [
    {
      "fieldName": "type",
      "fieldType": "Integer"
    },
    {
      "fieldName": "tanggal",
      "fieldType": "LocalDate"
    },
    {
      "fieldName": "tglOrder",
      "fieldType": "LocalDate"
    },
    {
      "fieldName": "jmlOrder",
      "fieldType": "Long"
    },
    {
      "fieldName": "jmlOrderCancel",
      "fieldType": "Long"
    },
    {
      "fieldName": "noProformaPnbp",
      "fieldType": "String"
    },
    {
      "fieldName": "noProformaJasa",
      "fieldType": "String"
    },
    {
      "fieldName": "noBillpymPnbp",
      "fieldType": "String"
    },
    {
      "fieldName": "noBillpymJasa",
      "fieldType": "String"
    },
    {
      "fieldName": "amountPnbp",
      "fieldType": "Long"
    },
    {
      "fieldName": "taxPnbp",
      "fieldType": "Long"
    },
    {
      "fieldName": "totalAmountPnbp",
      "fieldType": "Long"
    },
    {
      "fieldName": "amountJasa",
      "fieldType": "Long"
    },
    {
      "fieldName": "vatJasa",
      "fieldType": "Long"
    },
    {
      "fieldName": "taxJasa",
      "fieldType": "Long"
    },
    {
      "fieldName": "totalAmountJasa",
      "fieldType": "Long"
    },
    {
      "fieldName": "fileProformaPnbp",
      "fieldType": "String"
    },
    {
      "fieldName": "fileProformaJasa",
      "fieldType": "String"
    },
    {
      "fieldName": "fileBillpymPnbp",
      "fieldType": "String"
    },
    {
      "fieldName": "fileBillpymJasa",
      "fieldType": "String"
    },
    {
      "fieldName": "fileBulk",
      "fieldType": "String"
    },
    {
      "fieldName": "fileTax",
      "fieldType": "String"
    },
    {
      "fieldName": "fileTxt",
      "fieldType": "String"
    },
    {
      "fieldName": "status",
      "fieldType": "Integer"
    },
    {
      "fieldName": "updateBy",
      "fieldType": "String"
    },
    {
      "fieldName": "updateOn",
      "fieldType": "ZonedDateTime"
    }
  ],
  "name": "Invoice",
  "pagination": "pagination",
  "relationships": [],
  "searchEngine": "no"
}
