id;penggunaan;nama;jenis_kelamin;status_kawin;kelahiran;tgl_lahir;pekerjaan;warga_negara;jenis_id;no_id;alamat;rt;rw;kelurahan;kecamatan;kota;provinsi;kode_pos;no_kontak
1;so;fondly bah;supposing;perfume ill;misplace thoroughly solid;2023-12-14;forest hmph below;since;wildly above;neuter;lovely;pish wretched;terribly;endear artist carelessly;justly oh;now sick neighboring;brr minus;for;excluding ick
2;cholesterol;romanticise fooey;fumbling;detailed genre;coaxingly entertain;2023-12-14;evil pal;through inasmuch yacht;jovially what underwriting;softly;how;of traipse given;um excluding till;putrid outgrow fast;conference gadzooks sign;scared;separately savage;octave;manor good-natured yuck
3;unimpressively;hypochondria punctually;joyfully generously after;prey;sweet basketball;2023-12-14;blank valiantly demerge;joyfully;uh-huh dishonest defiant;with;boost earn arraign;runaway;mmm yum;upward lime;wrench abaft than;deliberately hostel who;wrongly dearly though;defensive fare;solidly
4;beyond victoriously private;before vacant;wearily;polymerise;since until;2023-12-14;beseech spice;throughout ha;so naturally boohoo;inasmuch circa;elegantly switch;disembowel;who for;expectancy;zoot-suit;tan;patiently drat sans;neatly deceivingly playfully;although
5;canine geez talkative;past cautiously speedily;whoever under;fatally;worth;2023-12-14;ah exchange;hence cello unexpectedly;blindfold allege;amid which;merrily;round true meh;joyous colorize by;print stealthily;versus inasmuch;via calibrate;aha militarize restaurant;after cylindrical furiously;cashier abbreviate shepherd
6;curiously blaspheme;as cheerfully given;cheap unwritten harsh;duh strategy;whether jingle;2023-12-15;forwards well oof;fatally whoever pro;altar;ATM;solemnly voluntarily;supposing stall;hit onto;likely;bumpy;stultify repayment;skinny;quicker obnoxiously revenue;athwart seldom outbid
7;yearningly;with circa;hm evenly;kookily despite fix;gesture;2023-12-14;cygnet;hare incinerate;harmonica;woot sandbag;colorfully;pish;despite;violation brew;gaseous inasmuch ouch;finally although shack;anenst;furrow;frightfully
8;reassuringly;freezer;oily propound;amidst plenty;comment to;2023-12-14;rumor;bouncy;eek oof;liquidity why with;besides careless;up assured ick;carnival;apud goof;huzzah;self nor huzzah;slim well;bowdlerise;ew er
9;instead;wisely;classic pension parole;if save;weakly boo;2023-12-14;brighten bossy;elevator billet compact;equally;and provided except;upside-down ouch corny;wetsuit quick-witted after;direct meaty;likewise;doubtfully;attorney;yuck;crystallise absent sonar;unlike through roughen
10;ew moderate periodic;almost cannibalise;modulo;courageous acrobatic strictly;shout separately;2023-12-14;circa lone;cross converse woot;likewise individualise;knee;batter along;oof;soot lever;phase yahoo;bah shade;absentmindedly wherever loyalty;caliber;majestic;amidst dapper
