{
  "annotations": {
    "changelogDate": "20231215021010"
  },
  "applications": "*",
  "entityTableName": "penerima_kuasa",
  "fields": [
    {
      "fieldName": "titel",
      "fieldType": "String"
    },
    {
      "fieldName": "nama",
      "fieldType": "String"
    },
    {
      "fieldName": "komparisi",
      "fieldType": "String"
    },
    {
      "fieldName": "tts",
      "fieldType": "String"
    },
    {
      "fieldName": "sk",
      "fieldType": "String"
    },
    {
      "fieldName": "tanggalSk",
      "fieldType": "LocalDate"
    },
    {
      "fieldName": "noKontak",
      "fieldType": "String"
    },
    {
      "fieldName": "recordStatus",
      "fieldType": "Integer"
    },
    {
      "fieldName": "updateBy",
      "fieldType": "String"
    },
    {
      "fieldName": "updateOn",
      "fieldType": "ZonedDateTime"
    }
  ],
  "name": "PenerimaKuasa",
  "pagination": "pagination",
  "relationships": [],
  "searchEngine": "no"
}
