id;titel;nama;komparisi;tts;sk;tanggal_sk;no_kontak;record_status;update_by;update_on
1;rectangular sad furiously;mockingly;in excluding fooey;precipitation;whoever;2023-12-14;anenst;15415;unless octave provided;2023-12-14T14:31:16
2;orderly lest standard;fickle loosely;post inasmuch;however yet ack;garbage geez;2023-12-14;er colonial minor;31370;whose;2023-12-14T05:23:51
3;miserly mechanize baptise;jive eek easily;pfft neigh swamp;roughly;amongst elegantly;2023-12-14;primary;1298;sheepishly onto excepting;2023-12-14T12:28:52
4;greatly;actually confidence how;gesticulate;up yowza shame;awful;2023-12-14;amidst;28439;what rib yomp;2023-12-14T14:30:59
5;hesitation quaintly;hence dishonest colorfully;although;for blue appetizer;model;2023-12-14;that including zowie;1900;yet deliberately anenst;2023-12-14T16:06:05
6;gosh;island pfft;idolized safely;cloth;unruly past;2023-12-14;absent where;11315;spurt failure furthermore;2023-12-14T06:05:14
7;amazing;spherical unripe issue;paltry aha chemotaxis;hardship;age painfully above;2023-12-14;frost given;8153;incidentally yum;2023-12-14T13:48:40
8;mostly buffet revisit;brr every onto;tomorrow but likewise;phew arrogantly;wordy offensively;2023-12-15;unlike anxiously;31253;upwardly badly;2023-12-14T03:19:20
9;illiterate aha;only;aboard or avenue;purity;only worker;2023-12-14;legal custody;22675;mushy meek;2023-12-15T01:55:36
10;aha amongst;belly;worried;provided;ugly exhausted;2023-12-14;nutritious per;12841;helpfully diligent why;2023-12-14T22:23:29
