id;nama;nama_short;titel_short_one;titel_short_two;titel_long_one;titel_long_two;wilayah_kerja;kedudukan;sk;tgl_sk;jenis_hari_kerja;jam_kerja_awal_one;jam_kerja_akhir_one;jam_kerja_awal_two;jam_kerja_akhir_two;selisih_pukul;jam_rest_awal_one;jam_rest_akhir_one;jam_rest_awal_two;jam_rest_akhir_two;maks_akta;maks_order_harian;lembar_sk;lembar_sumpah;alamat_kantor;alamat_email;no_kontak;record_status;update_by;update_on
1;why steam shore;atrium;court to hockey;picturize;drat notwithstanding wherever;from;excepting postage between;known per;duh;2023-12-14;18029;2023-12-14T09:19:27;2023-12-14T04:21:32;2023-12-14T19:02:17;2023-12-14T12:09:46;13851;2023-12-14T22:59:58;2023-12-14T18:57:24;2023-12-14T17:44:18;2023-12-14T21:18:13;20445;12993;shrilly initiative;yin yet;doctrine since briefly;hoick;before;11067;sniveling;2023-12-14T17:22:23
2;firm eek really;hospitable;during;without;inasmuch ugh;slowly;definite;sleepy;puny aw;2023-12-14;23083;2023-12-14T23:59:11;2023-12-14T16:12:00;2023-12-14T22:54:48;2023-12-15T02:01:19;24290;2023-12-14T06:41:39;2023-12-15T00:01:56;2023-12-14T20:34:24;2023-12-14T03:05:51;19457;25098;hungrily frightened ick;woot following as;requite which;moral unexpectedly;when gah;26914;prime;2023-12-14T20:49:10
3;shed um;over;zowie consequently;meh furthermore;offload characterization;offensively promptly;zowie ah;uneven adventurously ack;bare minus;2023-12-14;26350;2023-12-14T22:11:42;2023-12-14T02:57:00;2023-12-14T03:50:37;2023-12-14T09:30:15;32048;2023-12-14T03:43:49;2023-12-14T03:15:30;2023-12-14T10:38:04;2023-12-14T13:07:30;9098;20895;though instead effective;segment enthrall;centre oof embarrassed;what;inquisitively steel;4501;jumpsuit dearest doorstep;2023-12-14T04:10:59
4;unless coagulate;aha adventurously;yum realization;if salty once;via chief;firm gracefully;hatbox thoroughly;even sweetly;zowie breakable;2023-12-15;16401;2023-12-14T03:30:27;2023-12-14T02:53:47;2023-12-15T02:02:32;2023-12-14T08:45:10;23524;2023-12-14T18:22:47;2023-12-14T17:00:50;2023-12-14T04:01:32;2023-12-14T04:34:32;18908;27849;weary pro spouse;atop bacon sanctify;compliment pick;enchanted;oxygen undock;17670;whenever infamous;2023-12-14T20:49:02
5;freely;naive editorial define;past;whose;by overpay within;productive valiantly;needily;radiate admired next;fitting whose average;2023-12-14;12320;2023-12-14T22:34:15;2023-12-14T06:07:23;2023-12-14T23:25:04;2023-12-14T16:09:52;17419;2023-12-14T17:10:06;2023-12-14T06:13:18;2023-12-14T02:15:06;2023-12-14T17:09:37;14846;3260;brr badger vice;since well-to-do beyond;click till as;yippee as humming;who handy;22033;showy starchy whether;2023-12-14T12:38:03
6;now;upside-down pro;sprinkles begin though;ah dry before;pish so;rapidly pfft intertwine;interpreter;er;teleport;2023-12-14;15213;2023-12-14T19:45:27;2023-12-14T13:54:47;2023-12-14T21:02:23;2023-12-14T16:55:46;11782;2023-12-14T04:20:59;2023-12-14T20:48:26;2023-12-14T17:35:27;2023-12-14T04:06:54;31167;16442;witter even energetically;upon furiously;wound;while ferryboat;aw upset quarrelsomely;2990;phew;2023-12-14T21:07:40
7;freshen across;ah eek;hmph;within limply;meh valiantly;regal woot;shoehorn;speedy high-level;vice babble pish;2023-12-14;18333;2023-12-14T09:05:17;2023-12-14T14:52:04;2023-12-14T19:10:37;2023-12-14T05:10:11;9455;2023-12-14T13:16:51;2023-12-14T22:04:57;2023-12-14T06:16:22;2023-12-14T10:23:06;28037;29375;from at sailor;uh-huh network ferociously;lucky;among gee consult;after where;1144;google toward;2023-12-14T19:40:42
8;at anenst;yippee aw;debrief parking experiment;roasted oh important;readily grapefruit finally;than nonstop er;or;where daintily;yeast pen disgorge;2023-12-14;25551;2023-12-14T02:27:37;2023-12-14T19:24:38;2023-12-14T07:48:33;2023-12-14T13:13:03;19049;2023-12-14T20:45:35;2023-12-14T11:11:24;2023-12-14T13:48:50;2023-12-14T06:28:38;6430;16311;attach about;metabolize glimpse as;boohoo meh;fabulous invent seriously;abnormally warmly;29077;percolate ew wildly;2023-12-14T12:51:41
9;equally;indeed;hurtful quaintly overcook;regularise mmm;huzzah zowie merrily;harmful;considering spanish owlishly;besides;meh trusting mysteriously;2023-12-14;28596;2023-12-14T12:04:38;2023-12-14T11:25:10;2023-12-15T00:46:22;2023-12-14T13:16:17;21108;2023-12-14T10:56:16;2023-12-14T23:36:28;2023-12-14T21:01:31;2023-12-14T11:43:29;7418;26569;usher;bull dupe;inasmuch lightly;where fatally rubbery;generally gladly flytrap;11477;film replica;2023-12-14T10:05:20
10;underneath boo zowie;regarding;anti envy unabashedly;practical blindly the;boo modulo;impractical phew dreary;ah;joyfully where;swiftly;2023-12-14;14132;2023-12-14T04:17:35;2023-12-14T18:38:15;2023-12-15T01:54:31;2023-12-15T01:43:29;13210;2023-12-14T16:24:52;2023-12-14T13:26:10;2023-12-14T17:55:53;2023-12-14T09:02:12;6897;3390;nearer fabricate whelp;skirt repulsive;yowza;unwieldy times;decouple;23812;stale;2023-12-14T11:46:30
