id;type;tanggal;tgl_order;jml_order;jml_order_cancel;no_proforma_pnbp;no_proforma_jasa;no_billpym_pnbp;no_billpym_jasa;amount_pnbp;tax_pnbp;total_amount_pnbp;amount_jasa;vat_jasa;tax_jasa;total_amount_jasa;file_proforma_pnbp;file_proforma_jasa;file_billpym_pnbp;file_billpym_jasa;file_bulk;file_tax;file_txt;status;update_by;update_on
1;13306;2023-12-14;2023-12-15;23419;4707;anti pronunciation;slew propitiate excluding;paranoia;miniaturize unless equally;24364;22206;31718;7183;19918;26931;29854;gobble oof including;fortunately;sharp stacking;clash even consequently;pro austere from;nor reduplicate why;empowerment padlock;5133;nor incidentally scratch;2023-12-14T04:01:17
2;8698;2023-12-14;2023-12-14;14811;12585;gosh;truly yuck;skid except mature;yuck;3205;9044;15633;7057;31064;21874;7927;flatline;angrily subtitle;whoever psst;inhere for;so mortified trusty;sup;unless;28912;frosting upright;2023-12-14T19:14:08
3;536;2023-12-14;2023-12-14;12376;9516;before not;erosion underneath contravene;whereas;aha yahoo;25774;26509;13880;22325;27051;16695;21776;confess;modernity accidentally;notwithstanding mechanically;oh aha;nearly brr;whether never meaningfully;over sector miserable;3368;dumbfound ruddy fact;2023-12-14T18:41:37
4;2266;2023-12-14;2023-12-14;13968;21535;hippodrome super whenever;daring collate;zowie agitated behind;blah;24265;32300;3179;15652;22599;8187;18550;though parka;enshrine leafy;ha consequently tenant;haunt yahoo;well-worn;before;slow incomparable boo;8921;duh hospitalise expend;2023-12-14T12:13:59
5;14987;2023-12-14;2023-12-14;18080;129;down;polite;who quickly;ouch extricate hm;16686;12008;7499;18739;24060;29707;22842;mmm yuck semester;hm to;maunder;following;punctuate;notable astride by;heap;9757;undershoot immigration perfumed;2023-12-14T08:37:39
6;4792;2023-12-14;2023-12-14;30073;8542;creamy freelance but;product frequent;whether engender;jovially;5158;24756;32043;14664;8892;10057;22035;meh spelling;if coordinate cautiously;brightly curve;oof furthermore than;nor vet nectar;abhor but;ack;17067;geez;2023-12-14T20:54:20
7;26508;2023-12-15;2023-12-14;21610;8139;sharp huzzah;drat distant fickle;honoree gosh lest;arise why;29008;28356;28842;6328;3432;23474;10295;those toot scrutinise;forwards;upliftingly ford;discharge;which;weakly pish via;ornament plummet;3212;afterwards;2023-12-14T15:04:30
8;6247;2023-12-14;2023-12-14;3915;32679;now;blah;yahoo;who glistening if;10537;11177;25657;23421;21597;30993;17742;continually eventually;queasily;ugh until for;often if qua;undo present;tuna regarding hence;growing;25285;scientific drat against;2023-12-14T13:04:11
9;5397;2023-12-15;2023-12-14;26219;26756;blocker;vice whereas;duel uh-huh;drat;10302;1519;25428;7260;17086;24265;14797;motionless mend;readily;cold whose;provided whoever yowza;dimly;near;eek;5736;stain commonly highly;2023-12-14T16:30:31
10;11051;2023-12-14;2023-12-14;14773;4780;warmly;woot;wrench disagreement tic;irritably proud;8688;20916;3957;5750;15117;26474;25034;waste as;hostel;playfully causal earth;whose reckless skyscraper;inasmuch;for;webbed than;7889;that;2023-12-14T18:04:39
