id;golongan_usaha;jenis;nama;kedudukan;no_akta;tgl_akta;nama_notaris;wil_kerja_notaris;sk_notaris;alamat;rt;rw;kelurahan;kecamatan;kota;provinsi;kode_pos;no_kontak;nama_sk;nomor_sk;tgl_sk;npwp;pj_nama;pj_jenis_kelamin;pj_status_kawin;pj_kelahiran;pj_tgl_lahir;pj_pekerjaan;pj_warga_negara;pj_jenis_id;pj_no_id;pj_alamat;pj_rt;pj_rw;pj_kelurahan;pj_kecamatan;pj_kota;pj_provinsi;pj_kode_pos;template;komparisi
1;turf on upset;yesterday typewriter develop;phew flail astride;colorize rot ack;suddenly;2023-12-14;aside crinkle as;criminal;boohoo tepid whereas;servant astride voyage;bah apprehensive aha;only;kiddingly;poise;realistic frugal;siding ugh;unlike scholarly precipitation;yieldingly grandmother below;nor quintessential bountiful;briefly blah innovation;refer aha;against dental;wherever gah;whose flanker;lycra onto an;void;2023-12-15;shadowbox whose;beautifully;eek;willing;whose abaft;once;delightfully;abnormally;cushion study physically;promptly;crossly boohoo;over;white;boo
2;digitalise;pace clearly hmph;subsidiary when;amidst;for oof enzyme;2023-12-14;lard;schematize;considering aware despite;scooter maximize quietly;resale;blah conductor;bound swiftly properly;mmm upbeat considering;considering accordance;siding;even flavor wail;cheerfully insist;jealous but pfft;meanwhile yet overpay;stormy why;while yum;excepting barring insubstantial;unexpectedly psst;grass shakily whereas;given yum;2023-12-14;heave ack porter;escalator scorn ha;likewise;judgementally finally;through eek footprint;phew however woot;save gadzooks;backlight discomfit tremendously;inwardly about soap;inverse;dulcimer;quixotic notwithstanding;why legal;opposite
3;fond ack monthly;heavily;taste;coordinator greed commonly;swab;2023-12-14;tightly;but frizzy far;spelt;commence over weasel;delve beneath cucumber;oh wherever;pepper spiritual aw;guitarist supposing;inasmuch generously;welcome alienated halloo;how zowie;psst delicious;plasticise abaft;immaculate;brr emend carefully;finally;boo perm round;what sombrero;angrily whenever hence;loom reversal joshingly;2023-12-14;bulky;speculate;twin gosh;phew;knot meh ugh;uninstall tomorrow refract;whose oval;dispossess abdicate hence;dare sort into;or;opposite;next;abaft worn wherever;supposing inasmuch whereas
4;daintily;vet for continually;tidy obediently boo;chopsticks mill;ew;2023-12-14;off;nobble;immense hearten foodstuffs;remote;concerning theology calm;thyme within;equally pontificate yippee;while for;testament that finally;wig eek utterly;rightfully open concrete;less equatorial;whose;massive instead;hay pep;prime;back before ethyl;excepting;jealously than;yuck;2023-12-14;faint sow;upbeat temper commence;thin mud;now major accede;caution enthusiastically original;bureau;binge hence;on absentmindedly helpful;mismanage prisoner;since evil;certainly curvy out;forenenst;failing;valiantly
5;impair;surprisingly ha;stimulating barring blah;opossum;though even very;2023-12-15;madly;aha improve;boohoo yuck oof;bulky although unless;whether times packet;geez despite now;between aw tick;balance nervously;qualified precious;absent yum round;bypass;prospect;once atop loving;astride desist;till nearer gracefully;off warmly phooey;immense unto debase;nor amusing low;poll;afore;2023-12-14;besides;once;scrawl;geez envy;cleverly;yieldingly gah;by amuse;enraged;as ack;although enthusiastically passing;challenge;net than;corral spike;stealthily jubilantly
6;carefully past which;minus development save;certainly flirt;worriedly;intercut regularize plus;2023-12-14;boohoo;considering prey block;thoughtfully between;frantically lively depersonalise;misinterpret bus;via following;kindheartedly trachoma since;incidentally selling;fooey;lament prose superpose;quickly;decompose wildly notwithstanding;unto outperform;dependent loftily;quince loftily;by finance;save shameful;white sternly how;er;wherever;2023-12-14;strew quart;very broker;assist firebomb politicize;perfectly;licensing;er unto conscious;by crystallography regarding;shore whenever;notwithstanding;fiesta strengthen;righteously;pink road nor;vigilant aged;turnstile bewitched hm
7;unless;ultimately thoroughly;ritualize for;vivaciously;over;2023-12-14;than except briskly;which mid;wealthy pish;dime robe;whereas;through ride rankle;amass perfect scorch;young whoa vacantly;aware expectorate righteously;specific troubled lest;mmm well-lit for;promptly unlike cap;fiercely psst unimportant;round pro;who ha ferociously;whether barring;yuck before;relieved madly;positively glaring;icicle hm;2023-12-14;timely;painting er prison;rejigger;though urgently;promptly except;ouch for an;crazy dutiful successfully;lasagna hmph pinworm;ugh well-to-do;ample bloom;unsung gleeful;worn pastel fooey;while hm retrospectivity;whirlpool particularize
8;jam-packed muscle;happy-go-lucky;inside;er;shorts now badly;2023-12-14;vice;adduce miss meteorology;which;past zowie quench;seldom ick bitterly;furthermore;barricade sunday;explore sweat;yippee;disable;around educate;next;so;below glum;alongside accidentally pfft;whose for against;steal unethically prescription;cuckoo whimsical;woot astonishing;till legal;2023-12-14;upliftingly teeming inasmuch;manhunt wherever clinking;circa;bah fraction;doll pardon;dismal so across;international noteworthy beautifully;thankfully solidly speedy;nor hmph nor;sharply;extremely;till boastfully;unpleasant sympathetically ale;into atop gift
9;splendor unselfish;reason harmless ameliorate;creamy;nearest doubtfully tremendously;metallic uh-huh until;2023-12-14;bah;yawning abnormally first;than;promptly under emit;highly drat so;than mistake sadly;moral deliberately;croissant velvety outside;zowie unhappy octopus;hmph notwithstanding;abaft ideal eek;yum;veto beautifully;duh;beneficial;carol;tremendously;willfully;pro bless;anti;2023-12-14;ha;for;huzzah via;frisk ack;discourse;seemingly yowza;oppress before because;instead boomerang;ram;upside-down however;prohibition among;if what including;moan;sink regarding decamp
10;truly unless;index;till;whoa shameful annually;young desensitise;2023-12-15;er yellow oof;gah gah proceed;pish;absent lamb;over aha transliterate;so bossy abaft;stormy;papaya smoothly consequently;razz pfft;and who;model searchingly;rhinoceros;excepting mantua diligent;phooey;conscious;above underneath;behind whoa;ha;highlight;sternly gymnastics eek;2023-12-14;block aha;lively eek;before supposing shakily;oh readily;willfully;accuse female;out;whose;roadway;woot;owlishly who;portray gently;initialise sentimentalize;ouch some
