{
  "annotations": {
    "changelogDate": "20231215015610"
  },
  "applications": "*",
  "entityTableName": "order_data",
  "fields": [
    {
      "fieldName": "ppkNomor",
      "fieldType": "String"
    },
    {
      "fieldName": "ppkTanggal",
      "fieldType": "LocalDate"
    },
    {
      "fieldName": "nasabahNama",
      "fieldType": "String"
    },
    {
      "fieldName": "nasabahJenis",
      "fieldType": "Integer"
    },
    {
      "fieldName": "tanggal",
      "fieldType": "LocalDate"
    },
    {
      "fieldName": "status",
      "fieldType": "Integer"
    },
    {
      "fieldName": "type",
      "fieldType": "Integer"
    }
  ],
  "name": "OrderData",
  "pagination": "pagination",
  "relationships": [
    {
      "otherEntityName": "rawData",
      "relationshipName": "rawData",
      "relationshipSide": "left",
      "relationshipType": "many-to-one"
    },
    {
      "otherEntityName": "skSubtitusi",
      "relationshipName": "skSubtitusi",
      "relationshipSide": "left",
      "relationshipType": "many-to-one"
    },
    {
      "otherEntityName": "berkas",
      "relationshipName": "berkas",
      "relationshipSide": "left",
      "relationshipType": "many-to-one"
    },
    {
      "otherEntityName": "cabang",
      "relationshipName": "cabang",
      "relationshipSide": "left",
      "relationshipType": "many-to-one"
    }
  ],
  "searchEngine": "no"
}
