id;ppk_nomor;ppk_tanggal;nasabah_nama;nasabah_jenis;tanggal;status;type
1;rough;2023-12-14;divine huzzah;30333;2023-12-14;14751;26441
2;buy meek deem;2023-12-14;tomorrow soot;16248;2023-12-14;11361;9741
3;inasmuch;2023-12-14;foolishly lance decadence;31660;2023-12-14;25101;31427
4;eek given;2023-12-14;oof fiercely;1907;2023-12-14;56;17478
5;tie inasmuch anthropology;2023-12-14;whoa men consequently;29974;2023-12-14;16415;10579
6;vainly;2023-12-14;psst amongst gah;7160;2023-12-14;21998;9320
7;forenenst obedient;2023-12-14;why investigation;15815;2023-12-14;30624;22562
8;yuck promulgate;2023-12-14;alongside;13665;2023-12-15;19217;2022
9;plough;2023-12-14;meh;10200;2023-12-14;17403;4016
10;whine wherever;2023-12-14;through utilize;13079;2023-12-14;13607;24552
