id;identitas;kk;ppk;sk_nasabah;akta_pendirian;akta_perubahan;sk_pendirian;sk_perubahan;npwp;update_by;update_on;upload_by;upload_on;ppk_nomor;nsb_jenis;berkas_status;nama_nasabah;tanggal_ppk;metode_kirim;partition_id;verify_by;verify_on;order_type
1;passionate foster;trumpet;gadzooks phooey skullcap;excepting whoever;caring whether;before zowie;why if lest;meh;of;deeply whether snob;2023-12-14T13:26:38;aw;2023-12-14T22:32:44;supersize bleakly before;22026;2000;fooey than;2023-12-14;28962;15994;and;2023-12-14T18:28:06;22840
2;unbearably next ornery;oddball out;and;boohoo abaft dolman;doff drat;sans delicious;deputise;drug;once calorie protocol;against;2023-12-14T20:26:56;tight since;2023-12-14T10:17:40;hence than like;30758;25632;enormously since implement;2023-12-14;16273;5036;clock relative;2023-12-14T09:09:17;23203
3;plastic;squeaky law;boo over;limping pfft sequel;fearless;er uh-huh;city when;disparity valuable;snooper;smash an;2023-12-14T16:36:57;wildly wrench;2023-12-15T00:57:57;excepting;22391;19178;gadzooks;2023-12-14;6816;6459;filthy midst;2023-12-14T06:47:34;26939
4;skeletal timely provided;fabulous whopping;ugh briskly giving;yearly;denationalize;whose;spending;furl if;aside cheerfully uselessly;revolving realize now;2023-12-14T22:24:58;eek yum gee;2023-12-14T15:01:52;inflect afterwards;9986;24301;oh;2023-12-14;31596;2516;while;2023-12-14T01:59:52;6734
5;ew;as honestly loftily;girl quickly;starch;ah;limping bandage;urge sandbar;barring like yieldingly;queasy;furthermore duck because;2023-12-14T10:55:09;regularly;2023-12-14T04:12:11;partridge;13502;29490;beloved;2023-12-14;22058;11972;or inasmuch engineer;2023-12-14T03:09:17;19761
6;how busily;establish cohesion unaccountably;arithmetic troubled;titter;sentimentalise bashfully envy;next;upside-down pfft try;ankle fooey;phew ringed;alongside ack;2023-12-14T14:53:29;tepid;2023-12-15T01:00:11;dagger verbalise more;10939;982;jealously;2023-12-14;9748;18880;generally debris;2023-12-14T02:07:57;16793
7;till internal;joint chisel dueling;often host;yowza congeal inasmuch;lest commonly sans;joshingly badly;sans hm;for crushing stinger;gosh gah notable;geyser aha self-assured;2023-12-14T20:46:50;puppy why behind;2023-12-14T20:47:14;via;11032;28664;predispose following whereas;2023-12-14;12813;687;worth;2023-12-14T15:06:26;1295
8;quirky huzzah gadzooks;forenenst;yippee nor;shabby;ripe;bah script;hm mysteriously;for oof wildly;woot upliftingly hourly;hops for;2023-12-14T13:12:33;cook reek loiter;2023-12-14T12:46:34;tune lightly;20776;1545;within which as;2023-12-14;14538;27486;vice nervously;2023-12-14T13:45:45;4748
9;rudely;er onto;ouch;aromatic lean;boohoo worthless frivolous;seriously;round;identical atop;unnecessarily;pro flutter;2023-12-14T03:18:31;cell;2023-12-15T01:18:14;coordinated switch;32766;8705;below not wiretap;2023-12-14;17107;22356;for;2023-12-14T03:54:52;32358
10;wilted outside fooey;ew;teeming;along afore;account huzzah whirring;healthily ligate blindly;underneath as woot;bivouac memorialise;aha catalysis;that glean;2023-12-14T05:03:57;generously;2023-12-14T18:04:38;which writhing;21205;14380;uh-huh unequaled;2023-12-14;26858;15666;lest lean easily;2023-12-14T10:45:53;11536
