{
  "annotations": {
    "changelogDate": "20231215020010"
  },
  "applications": "*",
  "entityTableName": "cabang",
  "fields": [
    {
      "fieldName": "kode",
      "fieldType": "String"
    },
    {
      "fieldName": "nama",
      "fieldType": "String"
    },
    {
      "fieldName": "alamat",
      "fieldType": "String"
    },
    {
      "fieldName": "kota",
      "fieldType": "String"
    },
    {
      "fieldName": "provinsi",
      "fieldType": "String"
    },
    {
      "fieldName": "pengadilanNegeri",
      "fieldType": "String"
    },
    {
      "fieldName": "noKontak",
      "fieldType": "String"
    },
    {
      "fieldName": "recordStatus",
      "fieldType": "Integer"
    },
    {
      "fieldName": "updateBy",
      "fieldType": "String"
    },
    {
      "fieldName": "updateOn",
      "fieldType": "ZonedDateTime"
    },
    {
      "fieldName": "startDate",
      "fieldType": "LocalDate"
    }
  ],
  "name": "Cabang",
  "pagination": "pagination",
  "relationships": [
    {
      "otherEntityName": "leasing",
      "relationshipName": "leasing",
      "relationshipSide": "left",
      "relationshipType": "many-to-one"
    }
  ],
  "searchEngine": "no"
}
