2023-01-13 08:29:13,992 WARN  [restartedMain] ConfigServicePropertySourceLocator: Could not locate PropertySource: I/O error on GET request for "http://localhost:8888/sisteminformasiakademik/dev/master": Connection refused: connect; nested exception is java.net.ConnectException: Connection refused: connect
2023-01-13 08:29:14,005 INFO  [restartedMain] SisteminformasiakademikApp: The following profiles are active: dev,swagger
2023-01-13 08:29:20,130 DEBUG [restartedMain] InternalLoggerFactory: Using SLF4J as the default logging framework
2023-01-13 08:29:20,749 DEBUG [restartedMain] Ehcache-usersByLogin: Initialize successful.
2023-01-13 08:29:20,776 DEBUG [restartedMain] Ehcache-usersByEmail: Initialize successful.
2023-01-13 08:29:20,780 DEBUG [restartedMain] User: Initialize successful.
2023-01-13 08:29:20,785 DEBUG [restartedMain] Authority: Initialize successful.
2023-01-13 08:29:20,787 DEBUG [restartedMain] authorities: Initialize successful.
2023-01-13 08:29:20,792 DEBUG [restartedMain] Siswa: Initialize successful.
2023-01-13 08:29:20,795 DEBUG [restartedMain] Kelas: Initialize successful.
2023-01-13 08:29:20,798 DEBUG [restartedMain] JenisPembayaran: Initialize successful.
2023-01-13 08:29:20,802 DEBUG [restartedMain] BesarBayar: Initialize successful.
2023-01-13 08:29:20,810 DEBUG [restartedMain] Tagihan: Initialize successful.
2023-01-13 08:29:20,815 DEBUG [restartedMain] Transaksi: Initialize successful.
2023-01-13 08:29:20,830 DEBUG [restartedMain] AsyncConfiguration: Creating Async Task Executor
2023-01-13 08:29:20,942 DEBUG [restartedMain] LiquibaseConfiguration: Configuring Liquibase
2023-01-13 08:29:21,224 WARN  [sisteminformasiakademik-task-1] AsyncSpringLiquibase: Starting Liquibase asynchronously, your database might not be ready at startup!
2023-01-13 08:29:23,122 WARN  [restartedMain] cache: HHH90001006: Missing cache[com.akademik.app.domain.TahunAjaran] was created on-the-fly. The created cache will use a provider-specific default configuration: make sure you defined one. You can disable this warning by setting 'hibernate.javax.cache.missing_cache_strategy' to 'create'.
2023-01-13 08:29:23,131 DEBUG [restartedMain] TahunAjaran: Initialize successful.
2023-01-13 08:29:23,133 WARN  [restartedMain] cache: HHH90001006: Missing cache[com.akademik.app.domain.Surat] was created on-the-fly. The created cache will use a provider-specific default configuration: make sure you defined one. You can disable this warning by setting 'hibernate.javax.cache.missing_cache_strategy' to 'create'.
2023-01-13 08:29:23,135 DEBUG [restartedMain] Surat: Initialize successful.
2023-01-13 08:29:23,137 WARN  [restartedMain] cache: HHH90001006: Missing cache[com.akademik.app.domain.PhotoProfil] was created on-the-fly. The created cache will use a provider-specific default configuration: make sure you defined one. You can disable this warning by setting 'hibernate.javax.cache.missing_cache_strategy' to 'create'.
2023-01-13 08:29:23,140 DEBUG [restartedMain] PhotoProfil: Initialize successful.
2023-01-13 08:29:23,145 WARN  [restartedMain] cache: HHH90001006: Missing cache[com.akademik.app.domain.Channel] was created on-the-fly. The created cache will use a provider-specific default configuration: make sure you defined one. You can disable this warning by setting 'hibernate.javax.cache.missing_cache_strategy' to 'create'.
2023-01-13 08:29:23,149 DEBUG [restartedMain] Channel: Initialize successful.
2023-01-13 08:29:23,151 WARN  [restartedMain] cache: HHH90001006: Missing cache[com.akademik.app.domain.TitipanDana] was created on-the-fly. The created cache will use a provider-specific default configuration: make sure you defined one. You can disable this warning by setting 'hibernate.javax.cache.missing_cache_strategy' to 'create'.
2023-01-13 08:29:23,154 DEBUG [restartedMain] TitipanDana: Initialize successful.
2023-01-13 08:29:23,162 WARN  [restartedMain] cache: HHH90001006: Missing cache[com.akademik.app.domain.Notification] was created on-the-fly. The created cache will use a provider-specific default configuration: make sure you defined one. You can disable this warning by setting 'hibernate.javax.cache.missing_cache_strategy' to 'create'.
2023-01-13 08:29:23,164 DEBUG [restartedMain] Notification: Initialize successful.
2023-01-13 08:29:24,671 DEBUG [restartedMain] WebConfigurer: Registering CORS filter
2023-01-13 08:29:24,735 INFO  [restartedMain] WebConfigurer: Web application configuration, using profiles: dev
2023-01-13 08:29:24,741 INFO  [restartedMain] WebConfigurer: Web application fully configured
2023-01-13 08:29:24,800 DEBUG [restartedMain] TokenProvider: Using a Base64-encoded JWT secret key
2023-01-13 08:29:28,599 DEBUG [restartedMain] SwaggerAutoConfiguration: Starting Swagger
2023-01-13 08:29:28,626 DEBUG [restartedMain] SwaggerAutoConfiguration: Started Swagger in 16 ms
2023-01-13 08:29:30,829 INFO  [restartedMain] SisteminformasiakademikApp: Started SisteminformasiakademikApp in 22.17 seconds (JVM running for 23.143)
2023-01-13 08:29:30,845 INFO  [restartedMain] SisteminformasiakademikApp: 
----------------------------------------------------------
	Application 'sisteminformasiakademik' is running! Access URLs:
	Local: 		http://localhost:8080/
	External: 	http://192.168.1.10:8080/
	Profile(s): 	[dev, swagger]
----------------------------------------------------------
