<svg width="32" height="29" viewBox="0 0 32 29" fill="none" xmlns="http://www.w3.org/2000/svg">
<path d="M4.35074 27.6383C4.35074 27.6383 4.32164 28.3538 5.0213 28.3538C5.89193 28.3538 13.0874 28.3441 13.0874 28.3441L13.0995 21.7343C13.0995 21.7343 12.9855 20.6454 14.0417 20.6454H17.3896C18.6398 20.6454 18.5634 21.7343 18.5634 21.7343L18.5488 28.3234C18.5488 28.3234 25.3732 28.3234 26.4452 28.3234C27.3328 28.3234 27.2928 27.4334 27.2928 27.4334V15.2445L16.1637 5.34625L4.35074 15.2458V27.6383Z" fill="#232323"/>
<path d="M0 14.3242C0 14.3242 1.00159 16.1722 3.1903 14.3242L16.2631 3.26427L28.5187 14.2551C31.0505 16.0812 32 14.2551 32 14.2551L16.2631 0L0 14.3242Z" fill="#232323"/>
<path d="M28.2204 3.23877H25.0689L25.0822 7.06204L28.2204 9.72607V3.23877Z" fill="#232323"/>
</svg>
