<svg width="30" height="30" viewBox="0 0 30 30" fill="none" xmlns="http://www.w3.org/2000/svg">
<path d="M15 1C7.26801 1 1 7.26801 1 15C1 22.7319 7.26801 29 15 29C22.7319 29 29 22.7319 29 15C29 7.26801 22.7319 1 15 1Z" stroke="#232323" stroke-width="1.5" stroke-linecap="round" stroke-linejoin="round"/>
<path d="M4.17939 23.884C4.17939 23.884 7.30002 19.9 15 19.9C22.7 19.9 25.8207 23.884 25.8207 23.884" stroke="#232323" stroke-width="1.5" stroke-linecap="round" stroke-linejoin="round"/>
<path d="M15 15C17.3197 15 19.2 13.1197 19.2 10.8C19.2 8.48042 17.3197 6.60001 15 6.60001C12.6803 6.60001 10.8 8.48042 10.8 10.8C10.8 13.1197 12.6803 15 15 15Z" stroke="#232323" stroke-width="1.5" stroke-linecap="round" stroke-linejoin="round"/>
</svg>
