<svg width="23" height="25" viewBox="0 0 23 25" fill="none" xmlns="http://www.w3.org/2000/svg">
<path d="M6.42131 15.9634H19.7803C21.2951 15.9634 22.5308 14.7277 22.5308 13.2129V7.59228C22.5308 7.58729 22.5308 7.57733 22.5308 7.57235C22.5308 7.5574 22.5308 7.54743 22.5308 7.53248C22.5308 7.52252 22.5308 7.51255 22.5258 7.50259C22.5258 7.49262 22.5208 7.47767 22.5208 7.46771C22.5208 7.45774 22.5159 7.44778 22.5159 7.43781C22.5109 7.42784 22.5109 7.41788 22.5059 7.40293C22.5009 7.39296 22.5009 7.383 22.4959 7.37303C22.4909 7.36307 22.4909 7.3531 22.486 7.34314C22.481 7.33317 22.476 7.3232 22.471 7.30826C22.466 7.29829 22.461 7.28833 22.4561 7.28334C22.4511 7.27338 22.4461 7.26341 22.4411 7.25345C22.4361 7.24348 22.4311 7.2385 22.4262 7.22853C22.4212 7.21857 22.4112 7.2086 22.4062 7.19863C22.4012 7.18867 22.3963 7.18369 22.3863 7.17372C22.3813 7.16375 22.3714 7.15877 22.3664 7.14881C22.3614 7.13884 22.3514 7.13386 22.3464 7.12389C22.3415 7.11393 22.3315 7.10894 22.3265 7.10396C22.3165 7.09399 22.3116 7.08901 22.3016 7.07905C22.2916 7.07406 22.2866 7.0641 22.2767 7.05911C22.2667 7.05413 22.2567 7.04417 22.2468 7.03918C22.2368 7.0342 22.2318 7.02922 22.2219 7.02423C22.2119 7.01925 22.2019 7.01427 22.192 7.0043C22.182 6.99932 22.172 6.99434 22.1621 6.98935C22.1521 6.98437 22.1421 6.97939 22.1322 6.97441C22.1222 6.96942 22.1122 6.96444 22.1023 6.95946C22.0923 6.95448 22.0823 6.95447 22.0724 6.94949C22.0624 6.94451 22.0475 6.93953 22.0375 6.93953C22.0275 6.93953 22.0176 6.93454 22.0126 6.93454C21.9976 6.92956 21.9877 6.92956 21.9727 6.92956C21.9677 6.92956 21.9628 6.92458 21.9528 6.92458L5.02114 4.58763V2.22577C5.02114 2.20085 5.02114 2.17594 5.01615 2.15601C5.01615 2.15103 5.01615 2.14604 5.01117 2.13608C5.01117 2.12113 5.00619 2.10618 5.00619 2.09123C5.00121 2.07628 5.00121 2.06632 4.99622 2.05137C4.99622 2.0414 4.99124 2.03642 4.99124 2.02645C4.98626 2.01151 4.98127 1.99656 4.97629 1.98161C4.97629 1.97663 4.97131 1.96666 4.97131 1.96168C4.96633 1.94673 4.96134 1.93676 4.95138 1.92182C4.94639 1.91683 4.94639 1.90687 4.94141 1.90188C4.93643 1.89192 4.93145 1.88195 4.92148 1.87199C4.9165 1.86202 4.91151 1.85704 4.90653 1.84707C4.90155 1.83711 4.89657 1.83212 4.89158 1.82216C4.8866 1.81219 4.87663 1.80223 4.87165 1.79226C4.86667 1.78728 4.86169 1.7823 4.8567 1.77731C4.84674 1.76735 4.83677 1.75738 4.82681 1.74742C4.82182 1.74243 4.81684 1.73745 4.81186 1.73247C4.80189 1.7225 4.79193 1.71254 4.77698 1.70257C4.77199 1.69759 4.76203 1.69261 4.75705 1.68762C4.74708 1.67766 4.73712 1.67267 4.72715 1.66271C4.7122 1.65274 4.69725 1.64278 4.68729 1.63779C4.6823 1.63281 4.67732 1.63281 4.67234 1.62783C4.65241 1.61786 4.62749 1.6079 4.60756 1.59793L0.935215 0.053254C0.5914 -0.0912481 0.197756 0.0682025 0.053254 0.412018C-0.0912481 0.755833 0.0682026 1.14948 0.412018 1.29398L3.67079 2.66924V5.71873V6.20207V9.90929V13.2229V17.4085C3.67079 18.8036 4.71718 19.9597 6.06753 20.1341C5.82337 20.5427 5.67887 21.021 5.67887 21.5293C5.67887 23.0291 6.89966 24.2449 8.39451 24.2449C9.88936 24.2449 11.1102 23.0241 11.1102 21.5293C11.1102 21.031 10.9756 20.5576 10.7364 20.159H16.7856C16.5464 20.5626 16.4119 21.031 16.4119 21.5293C16.4119 23.0291 17.6327 24.2449 19.1275 24.2449C20.6224 24.2449 21.8432 23.0241 21.8432 21.5293C21.8432 20.0344 20.6224 18.8136 19.1275 18.8136H6.42131C5.64399 18.8136 5.01615 18.1808 5.01615 17.4085V15.5847C5.42475 15.8239 5.90808 15.9634 6.42131 15.9634ZM9.76977 21.5243C9.76977 22.2817 9.1519 22.8946 8.3995 22.8946C7.64709 22.8946 7.02922 22.2767 7.02922 21.5243C7.02922 20.7719 7.64709 20.154 8.3995 20.154C9.1519 20.154 9.76977 20.7669 9.76977 21.5243ZM20.5028 21.5243C20.5028 22.2817 19.8849 22.8946 19.1325 22.8946C18.3801 22.8946 17.7622 22.2767 17.7622 21.5243C17.7622 20.7719 18.3801 20.154 19.1325 20.154C19.8849 20.154 20.5028 20.7669 20.5028 21.5243ZM19.7803 14.6181H6.42131C5.64399 14.6181 5.01615 13.9852 5.01615 13.2129V9.89933V6.1921V5.94296L21.1854 8.17029V13.2079C21.1854 13.9902 20.5526 14.6181 19.7803 14.6181Z" fill="#232323"/>
</svg>
