<svg width="45" height="42" viewBox="0 0 45 42" fill="none" xmlns="http://www.w3.org/2000/svg">
<path d="M44.16 5.421H11.592L10.66 0H2.408C1.076 0 0 1.078 0 2.409V4.817H6.602L10.85 29.526C10.944 30.07 11.467 30.511 12.02 30.511H40.547C41.879 30.511 42.957 29.434 42.957 28.1V25.694H15.078L14.491 22.28H36.533C39.193 22.28 41.705 20.152 42.144 17.53L44.16 5.421Z" fill="#414141"/>
<path d="M19.47 41.803C21.7703 41.803 23.635 39.9383 23.635 37.638C23.635 35.3377 21.7703 33.473 19.47 33.473C17.1697 33.473 15.305 35.3377 15.305 37.638C15.305 39.9383 17.1697 41.803 19.47 41.803Z" fill="#414141"/>
<path d="M29.762 37.637C29.762 39.936 31.625 41.801 33.924 41.801C36.225 41.801 38.092 39.936 38.092 37.637C38.092 35.338 36.225 33.471 33.924 33.471C31.625 33.471 29.762 35.339 29.762 37.637Z" fill="#414141"/>
</svg>
