[
    {
        "availability_zones": [
            "INTERNATIONAL"
        ],
        "benefits": [
            {
                "additional_information": null,
                "amount": {
                    "base": 1.5,
                    "promotion_bonus": 0,
                    "total_excluding_tax": 1.5
                },
                "type": "DATA",
                "unit": "GB",
                "unit_type": "DATA"
            }
        ],
        "description": "1.5GB data, 30 days",
        "destination": {
            "amount": 1000,
            "unit": "NGN",
            "unit_type": "CURRENCY"
        },
        "id": 115,
        "name": "MegaBlaze 1.5GB",
        "operator": {
            "country": {
                "iso_code": "NGA",
                "name": "Nigeria",
                "regions": null
            },
            "id": 1707,
            "name": "MegaMobile 3",
            "regions": null
        },
        "prices": {
            "retail": {
                "amount": 18.0149,
                "fee": 0,
                "unit": "AED",
                "unit_type": "CURRENCY"
            },
            "wholesale": {
                "amount": 13.5112,
                "fee": 0,
                "unit": "AED",
                "unit_type": "CURRENCY"
            }
        },
        "promotions": null,
        "rates": {
            "base": 74.0126709692699,
            "retail": 55.5096059373074,
            "wholesale": 74.0126709692699
        },
        "regions": null,
        "required_beneficiary_fields": null,
        "required_credit_party_identifier_fields": [
            [
                "mobile_number"
            ]
        ],
        "required_debit_party_identifier_fields": null,
        "required_sender_fields": null,
        "required_statement_identifier_fields": null,
        "service": {
            "id": 1,
            "name": "Mobile"
        },
        "source": {
            "amount": 13.5112,
            "unit": "AED",
            "unit_type": "CURRENCY"
        },
        "tags": [
            "DATA"
        ],
        "type": "FIXED_VALUE_RECHARGE",
        "validity": {
            "quantity": 30,
            "unit": "DAY"
        }
    },
    {
        "availability_zones": [
            "INTERNATIONAL"
        ],
        "benefits": [
            {
                "additional_information": "Unlimited WhatsApp Chat, Facebook, Instagram, Twitter",
                "amount": {
                    "base": 15,
                    "promotion_bonus": 0,
                    "total_excluding_tax": 15
                },
                "type": "DATA",
                "unit": "GB",
                "unit_type": "DATA"
            },
            {
                "additional_information": "Unlimited Digicel calls, 150 minutes to other networks, 400 minutes to 1 USA\/CAN number",
                "amount": {
                    "base": -1,
                    "promotion_bonus": 0,
                    "total_excluding_tax": -1
                },
                "type": "TALKTIME",
                "unit": "MINUTES",
                "unit_type": "TIME"
            }
        ],
        "description": "15GB data, Unlimited WhatsApp Chat, Facebook, Instagram, Twitter, Unlimited Digicel calls, 150 minutes to other networks, 400 minutes to 1 USA\/CAN number, 21 days",
        "destination": {
            "amount": 15,
            "unit": "USD",
            "unit_type": "CURRENCY"
        },
        "id": 133,
        "name": "El Salvador Megasoft $15",
        "operator": {
            "country": {
                "iso_code": "SLV",
                "name": "El Salvador",
                "regions": null
            },
            "id": 177,
            "name": "El Salvador Megasoft",
            "regions": null
        },
        "prices": {
            "retail": {
                "amount": 67.2576,
                "fee": 0,
                "unit": "AED",
                "unit_type": "CURRENCY"
            },
            "wholesale": {
                "amount": 50.44318182,
                "fee": 0,
                "unit": "AED",
                "unit_type": "CURRENCY"
            }
        },
        "promotions": null,
        "rates": {
            "base": 0.297364271221541,
            "retail": 0.223023123037397,
            "wholesale": 0.297364271221541
        },
        "regions": null,
        "required_beneficiary_fields": null,
        "required_credit_party_identifier_fields": [
            [
                "mobile_number"
            ]
        ],
        "required_debit_party_identifier_fields": null,
        "required_sender_fields": null,
        "required_statement_identifier_fields": null,
        "service": {
            "id": 1,
            "name": "Mobile"
        },
        "source": {
            "amount": 50.44318182,
            "unit": "AED",
            "unit_type": "CURRENCY"
        },
        "tags": [
            "BUNDLE"
        ],
        "type": "RANGED_VALUE_PAYMENT",
        "validity": {
            "quantity": 21,
            "unit": "DAY"
        }
    },
    {
        "availability_zones": [
            "INTERNATIONAL"
        ],
        "benefits": [
            {
                "additional_information": null,
                "amount": {
                    "base": 200,
                    "promotion_bonus": 0,
                    "total_excluding_tax": 200
                },
                "type": "DATA",
                "unit": "MB",
                "unit_type": "DATA"
            }
        ],
        "description": "200MB data, 7 days ",
        "destination": {
            "amount": 25,
            "unit": "ZAR",
            "unit_type": "CURRENCY"
        },
        "id": 1162,
        "name": "Weekly Data Bundles 200MB",
        "operator": {
            "country": {
                "iso_code": "ZAF",
                "name": "South Africa",
                "regions": null
            },
            "id": 1724,
            "name": "Megasoft South Africa",
            "regions": null
        },
        "prices": {
            "retail": {
                "amount": 11.0439,
                "fee": 0,
                "unit": "AED",
                "unit_type": "CURRENCY"
            },
            "wholesale": {
                "amount": 8.2829,
                "fee": 0,
                "unit": "AED",
                "unit_type": "CURRENCY"
            }
        },
        "promotions": null,
        "rates": {
            "base": 3.01826654915549,
            "retail": 2.26369307943752,
            "wholesale": 3.01826654915549
        },
        "regions": null,
        "required_beneficiary_fields": null,
        "required_credit_party_identifier_fields": [
            [
                "mobile_number"
            ]
        ],
        "required_debit_party_identifier_fields": null,
        "required_sender_fields": null,
        "required_statement_identifier_fields": null,
        "service": {
            "id": 1,
            "name": "Mobile"
        },
        "source": {
            "amount": 8.2829,
            "unit": "AED",
            "unit_type": "CURRENCY"
        },
        "tags": [
            "DATA"
        ],
        "type": "FIXED_VALUE_PIN_PURCHASE",
        "validity": {
            "quantity": 7,
            "unit": "DAY"
        }
    },
    {
        "availability_zones": [
            "INTERNATIONAL"
        ],
        "benefits": [
            {
                "additional_information": null,
                "amount": {
                    "base": 80,
                    "promotion_bonus": 0,
                    "total_excluding_tax": 80
                },
                "type": "DATA",
                "unit": "MB",
                "unit_type": "DATA"
            }
        ],
        "description": "Megasoft++, 80MB, 24 hours, valid till SIM card expiry date",
        "destination": {
            "amount": 5000,
            "unit": "IDR",
            "unit_type": "CURRENCY"
        },
        "id": 1251,
        "name": "80MB+ Megasoft",
        "operator": {
            "country": {
                "iso_code": "IDN",
                "name": "Indonesia",
                "regions": null
            },
            "id": 1327,
            "name": "Megasoft Indonesia",
            "regions": null
        },
        "prices": {
            "retail": {
                "amount": 2.5911,
                "fee": 0,
                "unit": "AED",
                "unit_type": "CURRENCY"
            },
            "wholesale": {
                "amount": 1.9433,
                "fee": 0,
                "unit": "AED",
                "unit_type": "CURRENCY"
            }
        },
        "promotions": null,
        "rates": {
            "base": 2572.94293212577,
            "retail": 1929.68237428119,
            "wholesale": 2572.94293212577
        },
        "regions": null,
        "required_beneficiary_fields": null,
        "required_credit_party_identifier_fields": [
            [
                "mobile_number"
            ]
        ],
        "required_debit_party_identifier_fields": null,
        "required_sender_fields": null,
        "required_statement_identifier_fields": null,
        "service": {
            "id": 1,
            "name": "Mobile"
        },
        "source": {
            "amount": 1.9433,
            "unit": "AED",
            "unit_type": "CURRENCY"
        },
        "tags": [
            "DATA"
        ],
        "type": "FIXED_VALUE_RECHARGE",
        "validity": null
    },
    {
        "availability_zones": [
            "INTERNATIONAL"
        ],
        "benefits": [
            {
                "additional_information": null,
                "amount": {
                    "base": 1.5,
                    "promotion_bonus": 0,
                    "total_excluding_tax": 1.5
                },
                "type": "DATA",
                "unit": "GB",
                "unit_type": "DATA"
            }
        ],
        "description": "1.5GB data, 30 days",
        "destination": {
            "amount": 50000,
            "unit": "IDR",
            "unit_type": "CURRENCY"
        },
        "id": 1257,
        "name": "Megasoft 24hr 1.5GB, 30 Days",
        "operator": {
            "country": {
                "iso_code": "IDN",
                "name": "Indonesia",
                "regions": null
            },
            "id": 215,
            "name": "Megasoft LARGE Indonesia",
            "regions": null
        },
        "prices": {
            "retail": {
                "amount": 23.4129,
                "fee": 0,
                "unit": "AED",
                "unit_type": "CURRENCY"
            },
            "wholesale": {
                "amount": 17.5597,
                "fee": 0,
                "unit": "AED",
                "unit_type": "CURRENCY"
            }
        },
        "promotions": null,
        "rates": {
            "base": 2847.42905630506,
            "retail": 2135.57483267771,
            "wholesale": 2847.42905630506
        },
        "regions": null,
        "required_beneficiary_fields": null,
        "required_credit_party_identifier_fields": [
            [
                "mobile_number"
            ]
        ],
        "required_debit_party_identifier_fields": null,
        "required_sender_fields": null,
        "required_statement_identifier_fields": null,
        "service": {
            "id": 1,
            "name": "Mobile"
        },
        "source": {
            "amount": 17.5597,
            "unit": "AED",
            "unit_type": "CURRENCY"
        },
        "tags": [
            "DATA"
        ],
        "type": "FIXED_VALUE_RECHARGE",
        "validity": {
            "quantity": 30,
            "unit": "DAY"
        }
    },
    {
        "availability_zones": [
            "INTERNATIONAL"
        ],
        "benefits": [
            {
                "additional_information": "10GB data + 10GB YouTube + Free YouTube access (0100-0600 WIB)",
                "amount": {
                    "base": 10,
                    "promotion_bonus": 0,
                    "total_excluding_tax": 10
                },
                "type": "DATA",
                "unit": "GB",
                "unit_type": "DATA"
            },
            {
                "additional_information": null,
                "amount": {
                    "base": 30,
                    "promotion_bonus": 0,
                    "total_excluding_tax": 30
                },
                "type": "TALKTIME",
                "unit": "MINUTES",
                "unit_type": "TIME"
            }
        ],
        "description": "10GB data + 10GB YouTube + Free YouTube access, 30 minutes talktime to all operators, 30 days",
        "destination": {
            "amount": 89000,
            "unit": "IDR",
            "unit_type": "CURRENCY"
        },
        "id": 1576,
        "name": "Xtra Combo Megasoft",
        "operator": {
            "country": {
                "iso_code": "IDN",
                "name": "Indonesia",
                "regions": null
            },
            "id": 215,
            "name": "Megasoft LARGE Indonesia",
            "regions": null
        },
        "prices": {
            "retail": {
                "amount": 39.6537,
                "fee": 0,
                "unit": "AED",
                "unit_type": "CURRENCY"
            },
            "wholesale": {
                "amount": 29.7403,
                "fee": 0,
                "unit": "AED",
                "unit_type": "CURRENCY"
            }
        },
        "promotions": null,
        "rates": {
            "base": 2992.57236813348,
            "retail": 2244.43116279187,
            "wholesale": 2992.57236813348
        },
        "regions": null,
        "required_beneficiary_fields": null,
        "required_credit_party_identifier_fields": [
            [
                "mobile_number"
            ]
        ],
        "required_debit_party_identifier_fields": null,
        "required_sender_fields": null,
        "required_statement_identifier_fields": null,
        "service": {
            "id": 1,
            "name": "Mobile"
        },
        "source": {
            "amount": 29.7403,
            "unit": "AED",
            "unit_type": "CURRENCY"
        },
        "tags": [
            "BUNDLE"
        ],
        "type": "RANGED_VALUE_PAYMENT",
        "validity": {
            "quantity": 30,
            "unit": "DAY"
        }
    },
    {
        "availability_zones": [
            "INTERNATIONAL"
        ],
        "benefits": [
            {
                "additional_information": "35GB data + 35GB YouTube + Free YouTube access",
                "amount": {
                    "base": 35,
                    "promotion_bonus": 0,
                    "total_excluding_tax": 35
                },
                "type": "DATA",
                "unit": "GB",
                "unit_type": "DATA"
            },
            {
                "additional_information": null,
                "amount": {
                    "base": 90,
                    "promotion_bonus": 0,
                    "total_excluding_tax": 90
                },
                "type": "TALKTIME",
                "unit": "MINUTES",
                "unit_type": "TIME"
            }
        ],
        "description": "35GB data + 35GB YouTube + Free YouTube access, 90 minutes talktime to all operators, 30 days",
        "destination": {
            "amount": 239000,
            "unit": "IDR",
            "unit_type": "CURRENCY"
        },
        "id": 1579,
        "name": "Xtra Combo Megasoft",
        "operator": {
            "country": {
                "iso_code": "IDN",
                "name": "Indonesia",
                "regions": null
            },
            "id": 215,
            "name": "Megasoft LARGE Indonesia",
            "regions": null
        },
        "prices": {
            "retail": {
                "amount": 105.9123,
                "fee": 0,
                "unit": "AED",
                "unit_type": "CURRENCY"
            },
            "wholesale": {
                "amount": 79.4342,
                "fee": 0,
                "unit": "AED",
                "unit_type": "CURRENCY"
            }
        },
        "promotions": null,
        "rates": {
            "base": 3008.77959367628,
            "retail": 2256.58398505178,
            "wholesale": 3008.77959367628
        },
        "regions": null,
        "required_beneficiary_fields": null,
        "required_credit_party_identifier_fields": [
            [
                "mobile_number"
            ]
        ],
        "required_debit_party_identifier_fields": null,
        "required_sender_fields": null,
        "required_statement_identifier_fields": null,
        "service": {
            "id": 1,
            "name": "Mobile"
        },
        "source": {
            "amount": 79.4342,
            "unit": "AED",
            "unit_type": "CURRENCY"
        },
        "tags": [
            "BUNDLE"
        ],
        "type": "RANGED_VALUE_PIN_PURCHASE",
        "validity": {
            "quantity": 30,
            "unit": "DAY"
        }
    },
    {
        "availability_zones": [
            "INTERNATIONAL"
        ],
        "benefits": [
            {
                "additional_information": "2GB data + 2GB Nite data",
                "amount": {
                    "base": 4,
                    "promotion_bonus": 0,
                    "total_excluding_tax": 4
                },
                "type": "DATA",
                "unit": "GB",
                "unit_type": "DATA"
            }
        ],
        "description": "2GB data + 2GB Nite data, 30 days",
        "destination": {
            "amount": 149,
            "unit": "ZAR",
            "unit_type": "CURRENCY"
        },
        "id": 1597,
        "name": "Megasoft 2GB + 2GB",
        "operator": {
            "country": {
                "iso_code": "ZAF",
                "name": "South Africa",
                "regions": null
            },
            "id": 1726,
            "name": "Megasoft South Africa",
            "regions": null
        },
        "prices": {
            "retail": {
                "amount": 56.0758,
                "fee": 0,
                "unit": "AED",
                "unit_type": "CURRENCY"
            },
            "wholesale": {
                "amount": 42.05681818,
                "fee": 0,
                "unit": "AED",
                "unit_type": "CURRENCY"
            }
        },
        "promotions": null,
        "rates": {
            "base": 3.54282626332528,
            "retail": 2.65711768713063,
            "wholesale": 3.54282626332528
        },
        "regions": null,
        "required_beneficiary_fields": null,
        "required_credit_party_identifier_fields": [
            [
                "mobile_number"
            ]
        ],
        "required_debit_party_identifier_fields": null,
        "required_sender_fields": null,
        "required_statement_identifier_fields": null,
        "service": {
            "id": 1,
            "name": "Mobile"
        },
        "source": {
            "amount": 42.05681818,
            "unit": "AED",
            "unit_type": "CURRENCY"
        },
        "tags": [
            "DATA"
        ],
        "type": "FIXED_VALUE_PIN_PURCHASE",
        "validity": {
            "quantity": 30,
            "unit": "DAY"
        }
    },
    {
        "availability_zones": [
            "INTERNATIONAL"
        ],
        "benefits": [
            {
                "additional_information": null,
                "amount": {
                    "base": 150,
                    "promotion_bonus": 0,
                    "total_excluding_tax": 150
                },
                "type": "DATA",
                "unit": "MB",
                "unit_type": "DATA"
            },
            {
                "additional_information": null,
                "amount": {
                    "base": 12,
                    "promotion_bonus": 0,
                    "total_excluding_tax": 12
                },
                "type": "TALKTIME",
                "unit": "MINUTES",
                "unit_type": "TIME"
            }
        ],
        "description": "150MB Data, 12 minutes, 7 Days",
        "destination": {
            "amount": 27,
            "unit": "BDT",
            "unit_type": "CURRENCY"
        },
        "id": 1638,
        "name": "Megasoft 150MB, 7 Days - 27 BDT",
        "operator": {
            "country": {
                "iso_code": "BGD",
                "name": "Bangladesh",
                "regions": null
            },
            "id": 1449,
            "name": "Megasoft Bangladesh",
            "regions": null
        },
        "prices": {
            "retail": {
                "amount": 2.1107,
                "fee": 0,
                "unit": "AED",
                "unit_type": "CURRENCY"
            },
            "wholesale": {
                "amount": 1.583,
                "fee": 0,
                "unit": "AED",
                "unit_type": "CURRENCY"
            }
        },
        "promotions": null,
        "rates": {
            "base": 17.0562223626027,
            "retail": 12.7919647510305,
            "wholesale": 17.0562223626027
        },
        "regions": null,
        "required_beneficiary_fields": null,
        "required_credit_party_identifier_fields": [
            [
                "mobile_number"
            ]
        ],
        "required_debit_party_identifier_fields": null,
        "required_sender_fields": null,
        "required_statement_identifier_fields": null,
        "service": {
            "id": 1,
            "name": "Mobile"
        },
        "source": {
            "amount": 1.583,
            "unit": "AED",
            "unit_type": "CURRENCY"
        },
        "tags": [
            "BUNDLE"
        ],
        "type": "RANGED_VALUE_RECHARGE",
        "validity": {
            "quantity": 7,
            "unit": "DAY"
        }
    }
]
