<svg width="45" height="45" viewBox="0 0 45 45" fill="none" xmlns="http://www.w3.org/2000/svg">
<path d="M27.3314 17.2969V24.4386C27.3314 24.6195 27.1908 24.7601 27.0101 24.7601H25.8649C25.7544 24.7601 25.654 24.6998 25.6037 24.6294L22.3292 20.2099V24.4487C22.3292 24.6294 22.1886 24.7702 22.0079 24.7702H20.8627C20.682 24.7702 20.5412 24.6294 20.5412 24.4487V17.307C20.5412 17.1261 20.682 16.9855 20.8627 16.9855H21.9978C22.0982 16.9855 22.2088 17.0357 22.259 17.1261L25.5335 21.5458V17.307C25.5335 17.1261 25.6741 16.9855 25.8548 16.9855H27C27.1807 16.9754 27.3314 17.1261 27.3314 17.2969ZM19.0949 16.9754H17.9498C17.7691 16.9754 17.6283 17.116 17.6283 17.2969V24.4386C17.6283 24.6195 17.7691 24.7601 17.9498 24.7601H19.0949C19.2757 24.7601 19.4162 24.6195 19.4162 24.4386V17.2969C19.4162 17.1261 19.2757 16.9754 19.0949 16.9754ZM16.3327 22.9621H13.2088V17.2969C13.2088 17.116 13.068 16.9754 12.8873 16.9754H11.7421C11.5614 16.9754 11.4208 17.116 11.4208 17.2969V24.4386C11.4208 24.529 11.4509 24.5993 11.5112 24.6596C11.5715 24.7099 11.6417 24.75 11.7322 24.75H16.3226C16.5033 24.75 16.6441 24.6094 16.6441 24.4285V23.2835C16.6441 23.1127 16.5033 22.9621 16.3327 22.9621ZM33.3583 16.9754H28.7678C28.5971 16.9754 28.4465 17.116 28.4465 17.2969V24.4386C28.4465 24.6094 28.5871 24.7601 28.7678 24.7601H33.3583C33.539 24.7601 33.6796 24.6195 33.6796 24.4386V23.2934C33.6796 23.1127 33.539 22.9721 33.3583 22.9721H30.2344V21.7667H33.3583C33.539 21.7667 33.6796 21.6261 33.6796 21.4454V20.2901C33.6796 20.1094 33.539 19.9688 33.3583 19.9688H30.2344V18.7634H33.3583C33.539 18.7634 33.6796 18.6228 33.6796 18.4419V17.2969C33.6695 17.1261 33.529 16.9754 33.3583 16.9754ZM45 8.20657V36.8638C44.9899 41.3638 41.3035 45.0101 36.7934 45H8.13619C3.6362 44.9899 -0.0100591 41.2934 2.08492e-05 36.7934V8.13619C0.0101008 3.6362 3.70658 -0.0100054 8.20657 2.06269e-05H36.8638C41.3638 0.0101006 45.0101 3.6965 45 8.20657ZM38.8125 20.5213C38.8125 13.1886 31.4599 7.22215 22.4296 7.22215C13.3996 7.22215 6.04694 13.1886 6.04694 20.5213C6.04694 27.0904 11.8728 32.5949 19.7478 33.6395C21.6662 34.0513 21.4454 34.7544 21.0134 37.3359C20.943 37.7478 20.682 38.9531 22.4296 38.2199C24.1774 37.4866 31.8616 32.6651 35.3068 28.7077C37.6774 26.096 38.8125 23.4542 38.8125 20.5213Z" fill="#45BC00"/>
</svg>
