<svg width="45" height="45" viewBox="0 0 45 45" fill="none" xmlns="http://www.w3.org/2000/svg">
<g clip-path="url(#clip0)">
<path d="M38.442 6.53943C34.2117 2.32487 28.5867 0.0025714 22.5937 0C10.2441 0 0.194019 10.0027 0.189075 22.2973C0.187636 26.2274 1.21904 30.0637 3.17947 33.4453L0.000976562 45L11.8779 41.8994C15.1502 43.6762 18.8346 44.6124 22.584 44.6139H22.5936H22.5937C34.9412 44.6139 44.9928 34.6095 44.9981 22.3154C45.0001 16.3568 42.6717 10.7543 38.442 6.53943V6.53943ZM22.5937 40.8478H22.5864C19.2444 40.8461 15.9671 39.9528 13.1085 38.264L12.4282 37.8625L5.38016 39.7022L7.26189 32.8632L6.81865 32.1621C4.95445 29.211 3.97031 25.8006 3.97171 22.2988C3.97581 12.0798 12.329 3.76625 22.6007 3.76625C27.5748 3.76831 32.2499 5.69862 35.7659 9.20163C39.2818 12.7046 41.2166 17.3613 41.2151 22.3138C41.2107 32.5331 32.8572 40.8478 22.5937 40.8478V40.8478Z" fill="#E0E0E0"/>
<path d="M1.0293 43.7179L4.0626 32.691C2.19124 29.4638 1.20714 25.8025 1.20832 22.0527C1.21323 10.3199 10.8043 0.774414 22.5887 0.774414C28.3083 0.776985 33.6764 2.99309 37.7126 7.01523C41.7496 11.0373 43.9714 16.3836 43.9691 22.0693C43.9642 33.8025 34.3725 43.3488 22.5896 43.3488C22.5887 43.3488 22.5902 43.3488 22.5896 43.3488H22.5801C19.0019 43.3476 15.4861 42.4534 12.3635 40.759L1.0293 43.7179V43.7179Z" fill="url(#paint0_linear)"/>
<path fill-rule="evenodd" clip-rule="evenodd" d="M17.0582 12.8311C16.6437 11.9136 16.2073 11.8952 15.813 11.8792C15.4904 11.8654 15.1212 11.8662 14.7525 11.8662C14.3835 11.8662 13.7839 12.0043 13.2769 12.5556C12.7696 13.1069 11.3398 14.4396 11.3398 17.1502C11.3398 19.8611 13.323 22.4804 13.5995 22.8483C13.8762 23.2157 17.4278 28.956 23.0525 31.1643C27.7271 32.9996 28.6783 32.6345 29.693 32.5427C30.7077 32.4509 32.967 31.2102 33.4282 29.9237C33.8894 28.6374 33.8894 27.5348 33.751 27.3043C33.6127 27.0747 33.2437 26.937 32.6903 26.6615C32.1368 26.386 29.4163 25.0529 28.909 24.8693C28.4016 24.6856 28.0327 24.5937 27.6637 25.1453C27.2947 25.6964 26.2348 26.937 25.912 27.3043C25.5891 27.6725 25.2663 27.7184 24.7128 27.4429C24.1594 27.1666 22.3771 26.5854 20.2628 24.7085C18.6177 23.2483 17.507 21.4449 17.1842 20.8933C16.8613 20.3423 17.1496 20.0438 17.4272 19.7692C17.6756 19.5224 17.9806 19.126 18.2574 18.8043C18.5335 18.4826 18.6257 18.253 18.8102 17.8857C18.9947 17.5177 18.9025 17.1961 18.7641 16.9206C18.6257 16.645 17.5503 13.9205 17.0582 12.8311V12.8311Z" fill="white"/>
<path d="M38.2595 6.46853C34.0777 2.30235 28.5173 0.00675852 22.5931 0.00415039C10.3853 0.00415039 0.450595 9.89197 0.445687 22.0455C0.444248 25.9305 1.46381 29.7227 3.40173 33.0655L0.259766 44.4876L12.0004 41.4225C15.2352 43.1789 18.8773 44.1044 22.5836 44.1059H22.593H22.5931C34.799 44.1059 44.7351 34.2163 44.7403 22.0633C44.7423 16.1732 42.4406 10.635 38.2595 6.46853V6.46853ZM22.5931 40.3831H22.5859C19.2823 40.3814 16.0426 39.4983 13.2168 37.8289L12.5443 37.432L5.57719 39.2507L7.43729 32.4901L6.99914 31.7971C5.15635 28.8799 4.18349 25.5086 4.18493 22.047C4.18895 11.9454 12.4463 3.72724 22.6001 3.72724C27.5171 3.72926 32.1384 5.63742 35.6142 9.1002C39.0897 12.563 41.0022 17.1662 41.0008 22.0619C40.9964 32.1638 32.7388 40.3831 22.5931 40.3831Z" fill="white"/>
</g>
<defs>
<linearGradient id="paint0_linear" x1="22.4992" y1="43.7179" x2="22.4992" y2="0.774486" gradientUnits="userSpaceOnUse">
<stop stop-color="#20B038"/>
<stop offset="1" stop-color="#60D66A"/>
</linearGradient>
<clipPath id="clip0">
<rect width="45" height="45" fill="white"/>
</clipPath>
</defs>
</svg>
