<svg width="31" height="53" viewBox="0 0 31 53" fill="none" xmlns="http://www.w3.org/2000/svg">
<line x1="28.2401" y1="2.97487" x2="2.47503" y2="28.74" stroke="#FFFFFF" stroke-width="7"/>
<line x1="2.47487" y1="24.26" x2="28.24" y2="50.0251" stroke="#FFFFFF" stroke-width="7"/>
</svg>
