<svg width="30" height="30" viewBox="0 0 30 30" fill="none" xmlns="http://www.w3.org/2000/svg">
<path d="M15 7.50002C10.86 7.50002 7.5 10.86 7.5 15C7.5 19.14 10.86 22.5 15 22.5C19.14 22.5 22.5 19.14 22.5 15C22.5 10.86 19.14 7.50002 15 7.50002Z" fill="#0E3D67"/>
<path d="M15 0C6.71252 0 0 6.71252 0 15C0 23.2874 6.71252 29.9999 15 29.9999C23.2874 29.9999 30 23.2875 30 15C30 6.71245 23.2875 0 15 0ZM15 27C8.36999 27 2.99995 21.63 2.99995 15C2.99995 8.36992 8.36999 3.00002 15 3.00002C21.6299 3.00002 27 8.36999 27 15C27 21.6299 21.63 27 15 27Z" fill="#0E3D67"/>
</svg>
