<svg width="46" height="45" viewBox="0 0 46 45" fill="none" xmlns="http://www.w3.org/2000/svg">
<path d="M23 45C35.4264 45 45.5 34.9264 45.5 22.5C45.5 10.0736 35.4264 0 23 0C10.5736 0 0.5 10.0736 0.5 22.5C0.5 34.9264 10.5736 45 23 45Z" fill="#F1F3F6"/>
<path d="M32.9303 17.4828C32.9461 17.7234 32.9461 17.9641 32.9461 18.2047C32.9461 25.5437 27.7907 34 18.368 34C15.4651 34 12.7684 33.089 10.5 31.5078C10.9125 31.5594 11.309 31.5766 11.7373 31.5766C14.1326 31.5766 16.3376 30.7 18.0984 29.2047C15.8458 29.1531 13.9581 27.5547 13.3077 25.3547C13.625 25.4062 13.9423 25.4406 14.2754 25.4406C14.7354 25.4406 15.1955 25.3718 15.6238 25.2516C13.276 24.7359 11.5152 22.5016 11.5152 19.8031V19.7344C12.1973 20.1469 12.9905 20.4047 13.8312 20.439C12.4511 19.4421 11.5469 17.7406 11.5469 15.8156C11.5469 14.7844 11.8007 13.839 12.2449 13.014C14.7671 16.3828 18.5584 18.5827 22.8096 18.8234C22.7303 18.4109 22.6827 17.9813 22.6827 17.5516C22.6827 14.4922 24.967 12 27.8065 12C29.2817 12 30.6142 12.6703 31.5501 13.7531C32.7081 13.5125 33.8185 13.0484 34.802 12.4125C34.4213 13.7016 33.6123 14.7844 32.5495 15.4719C33.5806 15.3516 34.58 15.0422 35.5 14.6125C34.8021 15.7125 33.9296 16.6921 32.9303 17.4828Z" fill="#508BFF"/>
</svg>
