[
    {
       "key":"phone_number",
       "template":"phone_with_country",
       "title":"What is your phone number?",
       "label":"Phone Number",
       "validators":[
          {
             "type":"required",
             "options":[
                
             ],
             "message":"Phone number required"
          }
       ],
       "options":[
          {
             "label":"Nigeria",
             "icon":"http://images.com/Nigeria.jpg",
             "option_value":"NG_+234",
             "preselected":false,
             "form_elements":[
                
             ]
          }
       ]
    },
    {
       "key":"amount",
       "template":"money",
       "title":"How much do you want to top-up?",
       "label":"Top-up Amount",
       "validators":[
          {
             "type":"required",
             "options":[
                
             ],
             "message":"Amount cannot be empty"
          }
       ],
       "options":[
          {
             "label":"NGN",
             "icon":"U+20A6",
             "option_value":"NGN",
             "preselected":true,
             "form_elements":[
                
             ]
          }
       ]
    },
    {
       "key":"meter_number",
       "template":"text",
       "title":"What is your meter number?",
       "label":"Meter number",
       "validators":[
          {
             "type":"required",
             "options":[
                
             ],
             "message":"Meter number cannot be empty"
          }
       ],
       "options":[
          
       ]
    },
    {
       "key":"uic_number",
       "template":"number",
       "title":"What is your UIC number?",
       "label":"UIC number",
       "validators":[
          {
             "type":"required",
             "options":[
                
             ],
             "message":"UIC number cannot be empty"
          }
       ],
       "options":[
          
       ]
    },
    {
       "key":"plan",
       "template":"plans",
       "title":"Which package do you want?",
       "label":"Package",
       "validators":[
          {
             "type":"required",
             "options":[
                
             ],
             "message":"You must select a package"
          }
       ],
       "options":[
          
       ]
    },
    {
       "key":"church",
       "template":"list",
       "title":"What is your church?",
       "label":"Church",
       "validators":[
          {
             "type":"required",
             "options":[
                
             ],
             "message":"You must select a church"
          }
       ],
       "options":[
          
       ]
    },
    {
       "key":"user_identifier",
       "template":"authentication",
       "title":"Authentication",
       "label":"Do you want to share your Email?",
       "validators":[
          {
             "type":"required",
             "message":"Authentication is required",
             "options":[
                
             ]
          },
          {
             "type":"userLoggedIn",
             "message":"User must be logged in",
             "options":[
                
             ]
          }
       ],
       "options":[
          
       ]
    },
    {
       "key":"user_message",
       "template":"message",
       "title":"User message",
       "label":"Message text <b>strong text</b>",
       "validators":[
          
       ],
       "options":[
          
       ]
    },
    {
       "key":"user_message",
       "template":"message",
       "title":"User message",
       "label":"Message text <b>strong text</b>",
       "validators":[
          
       ],
       "options":[
          
       ]
    },
    {
       "key":"user_message",
       "template":"message_error",
       "title":"User message",
       "label":"Message text <b>strong text</b>",
       "validators":[
          
       ],
       "options":[
          
       ]
    },
    {
       "key":"stop",
       "template":"stop",
       "title":"",
       "label":"",
       "validators":[
          
       ],
       "options":[
          
       ]
    },
    {
       "key":"data_collection",
       "template":"data_collections_user_v2",
       "title":"Data collection",
       "label":"I authorize my data to be stored by Jumia and shared with partners",
       "validators":[
          
       ],
       "options":[
          
       ]
    },
    {
       "key":"paystack_code",
       "title":"Do you want to share your info?",
       "label":"Share info",
       "template":"webview",
       "validators":[
          {
             "type":"required",
             "options":[
                
             ],
             "message":"Required"
          }
       ],
       "options":[
          {
             "label":"Click Here",
             "icon":"",
             "option_value":"https://staging-one.jumia.com.ng/paystack",
             "message":"- Credit card details",
             "preselected":false,
             "form_elements":[
                
             ]
          }
       ]
    },
    {
       "key":"offers",
       "title":"Title",
       "label":"Label",
       "template":"detailed_offers",
       "validators":[
          {
             "type":"required",
             "options":[
                
             ],
             "message":"Please choose an offer"
          }
       ],
       "options":[
          
       ]
    },
    {
       "key":"slider",
       "template":"slider",
       "title":"",
       "label":"",
       "optional":true,
       "validators":[
          
       ],
       "options":[
          {
             "label":"NGN",
             "icon":"N",
             "option_value":"",
             "message":"",
             "preselected":true,
             "form_elements":[
                
             ]
          }
       ]
    },
    {
       "key":"birthdate",
       "title":"What is your date of birth?",
       "label":"Date of birth",
       "template":"date",
       "validators":[
          {
             "type":"required",
             "options":[
                
             ],
             "message":"Birthdate is required"
          },
          {
             "type":"date",
             "options":[
                {
                   "option":"max",
                   "value":"2002-01-01",
                   "message":"You must be at least 18 years old"
                },
                {
                   "option":"min",
                   "value":"1900-01-01",
                   "message":"You are too old"
                }
             ],
             "message":"Birthdate is not valid"
          }
       ],
       "options":[
          
       ]
    },
    {
       "key":"wait",
       "title":"",
       "label":"Please wait",
       "template":"loading",
       "validators":[
          
       ],
       "options":[
          {
             "label":"submit_value",
             "icon":"",
             "option_value":"this_string_should_be_submitted",
             "display_value":"",
             "message":"",
             "preselected":false,
             "form_elements":[
                
             ]
          },
          {
             "label":"retry_time",
             "icon":"",
             "option_value":"30",
             "display_value":"",
             "message":"",
             "preselected":false,
             "form_elements":[
                
             ]
          }
       ]
    },
    {
       "key":"otp_code",
       "title":"What is your OTP code?",
       "label":"OTP code",
       "template":"otp",
       "validators":[
          {
             "type":"required",
             "options":[
                
             ],
             "message":"OTP code is required"
          },
          {
             "type":"textLength",
             "options":[
                {
                   "option":"min",
                   "value":"4",
                   "message":"OTP code should be 4 digits"
                },
                {
                   "option":"max",
                   "value":"4",
                   "message":"OTP code should be 4 digits"
                }
             ],
             "message":"OTP code should be 4 digits"
          }
       ],
       "options":[
          {
             "label":"resend_value",
             "icon":"",
             "option_value":"RSND",
             "display_value":"Request a new code",
             "message":"",
             "preselected":false,
             "form_elements":[
                
             ]
          },
          {
             "label":"resend_time",
             "icon":"",
             "option_value":"30",
             "display_value":"",
             "message":"",
             "preselected":false,
             "form_elements":[
                
             ]
          }
       ]
    },
    {
       "key":"files",
       "title":"Choose some files",
       "label":"Files",
       "template":"file_upload",
       "validators":[
          {
             "type":"required",
             "options":[
                
             ],
             "message":"File upload is required"
          }
       ],
       "options":[
          {
             "label":"submit_value",
             "icon":"",
             "option_value":"something",
             "display_value":"",
             "message":"",
             "preselected":false,
             "form_elements":[
                
             ]
          }
       ]
    },
    {
       "key":"pin1",
       "template":"pin",
       "title":"Choose your Jumia Card PIN",
       "label":"PIN",
       "validators":[
          {
             "type":"required",
             "options":[
                
             ],
             "message":"PIN cannot be empty"
          },
          {
             "type":"textLength",
             "options":[
                {
                   "option":"min",
                   "value":"4",
                   "message":"Invalid PIN"
                },
                {
                   "option":"max",
                   "value":"4",
                   "message":"Invalid PIN"
                }
             ],
             "message":"Invalid PIN"
          }
       ],
       "options":[
          
       ]
    },
    {
       "key":"pin2",
       "template":"pin",
       "title":"Confirm your Jumia Card PIN",
       "label":"label_pin",
       "validators":[
          {
             "type":"required",
             "options":[
                
             ],
             "message":"PIN cannot be empty"
          },
          {
             "type":"textLength",
             "options":[
                {
                   "option":"min",
                   "value":"4",
                   "message":"Invalid PIN"
                },
                {
                   "option":"max",
                   "value":"4",
                   "message":"Invalid PIN"
                }
             ],
             "message":"Invalid PIN"
          },
          {
             "type":"match_field",
             "options":[
                {
                   "option":"field",
                   "value":"pin1",
                   "message":"PIN mismatch"
                }
             ],
             "message":"PIN mismatch"
          }
       ],
       "options":[
          
       ]
    },
    {
       "key":"region",
       "title":"Choose a region",
       "label":"Region",
       "template":"dynamic_list",
       "validators":[
          {
             "type":"required",
             "options":[
                
             ],
             "message":"Region is required"
          }
       ],
       "targets":[
          {
             "name":"field_key_sub_region"
          }
       ],
       "options":[
          {
             "label":"resource",
             "icon":"",
             "display_value":"https://some-api.com/region?parent_param=",
             "option_value":"",
             "message":"",
             "preselected":false,
             "form_elements":[
                
             ]
          },
          {
             "label":"prefetch",
             "icon":"",
             "option_value":"true",
             "display_value":"",
             "message":"",
             "preselected":false,
             "form_elements":[
                
             ]
          }
       ]
    }
 ]