<?xml version="1.0" encoding="utf-8"?>
<!-- Generator: Adobe Illustrator 21.0.2, SVG Export Plug-In . SVG Version: 6.00 Build 0)  -->
<svg version="1.1" id="webpay_1_" xmlns="http://www.w3.org/2000/svg" xmlns:xlink="http://www.w3.org/1999/xlink" x="0px" y="0px"
	 viewBox="0 0 102 58" style="enable-background:new 0 0 102 58;" xml:space="preserve">
<style type="text/css">
	.st0{fill:#BF2D2E;}
	.st1{fill:#3D3C97;}
	.st2{fill:#FFFFFF;}
	.st3{fill:#3E67AA;}
	.st4{fill:#E1A242;}
	.st5{fill:none;stroke:#808080;stroke-width:0.25;stroke-miterlimit:10;}
	.st6{fill:#004C94;}
	.st7{fill:#272425;}
	.st8{fill:#29769E;}
	.st9{fill:#A5A5A9;}
	.st10{fill:#2E4B7B;}
	.st11{fill:#203776;}
	.st12{fill:#EBB339;}
	.st13{fill:#BF2B29;}
	.st14{fill:#C5323E;}
	.st15{fill:#C1352A;}
	.st16{fill:none;stroke:#FFFFFF;stroke-width:0.7078;stroke-miterlimit:3.8636;}
	.st17{fill:#060506;}
	.st18{fill:#DC8835;}
	.st19{fill:#53256E;}
	.st20{fill:#417EB9;}
</style>
<g>
	<g>
		<polygon class="st0" points="10.1,40.8 29.2,40.8 27,48.8 10.1,48.8 		"/>
		<polygon class="st1" points="49.8,40.8 47.5,48.8 27,48.8 29.2,40.8 		"/>
		<path class="st2" d="M32.1,44.6c0.1-0.3,0.1-0.5,0.1-0.6c0-0.2-0.1-0.3-0.1-0.5c-0.1-0.1-0.1-0.2-0.2-0.3
			c-0.1-0.1-0.2-0.1-0.3-0.1c-0.1,0-0.2-0.1-0.3-0.1c-0.2,0-0.4,0.1-0.6,0.1c-0.2,0.1-0.4,0.2-0.5,0.4c-0.2,0.2-0.3,0.4-0.5,0.6
			c-0.1,0.3-0.3,0.6-0.4,1c-0.1,0.4-0.2,0.7-0.2,1c0,0.3,0,0.5,0.1,0.6c0.1,0.2,0.2,0.3,0.3,0.4c0.1,0.1,0.3,0.1,0.5,0.1
			s0.3,0,0.5-0.1c0.1-0.1,0.3-0.1,0.5-0.3c0.1-0.1,0.3-0.3,0.5-0.5c0.1-0.3,0.3-0.5,0.4-0.9c-0.3,0-0.5,0-0.7,0
			c-0.1,0.2-0.1,0.3-0.2,0.5s-0.2,0.2-0.3,0.3c-0.1,0.1-0.2,0.1-0.3,0.1c-0.1,0-0.3-0.1-0.3-0.1S30,46,30,45.8s0.1-0.4,0.1-0.6
			c0.1-0.3,0.1-0.5,0.3-0.6c0.1-0.2,0.2-0.3,0.3-0.4c0.1-0.1,0.3-0.1,0.4-0.1c0.1,0,0.2,0,0.3,0.1c0.1,0.1,0.1,0.1,0.1,0.2
			c0,0.1,0,0.3,0,0.4C31.7,44.6,31.9,44.6,32.1,44.6L32.1,44.6z M32.2,45.1c-0.1,0.4-0.1,0.7-0.1,1c0,0.3,0,0.5,0.1,0.6
			c0.1,0.2,0.2,0.3,0.3,0.4s0.3,0.1,0.5,0.1s0.4-0.1,0.6-0.1c0.2-0.1,0.4-0.2,0.5-0.4c0.2-0.2,0.3-0.4,0.5-0.6
			c0.1-0.3,0.3-0.6,0.3-1c0.1-0.4,0.1-0.7,0.1-1c0-0.3,0-0.5-0.1-0.6c-0.1-0.2-0.2-0.3-0.3-0.4C34.4,43,34.3,43,34.1,43
			s-0.4,0.1-0.6,0.1c-0.2,0.1-0.3,0.2-0.5,0.4s-0.3,0.4-0.5,0.6C32.4,44.4,32.3,44.7,32.2,45.1L32.2,45.1z M32.9,45.1
			c0.1-0.3,0.1-0.5,0.3-0.6s0.2-0.3,0.3-0.4s0.3-0.1,0.4-0.1c0.1,0,0.3,0.1,0.3,0.1c0.1,0.1,0.1,0.3,0.1,0.4c0,0.2,0,0.4-0.1,0.6
			c-0.1,0.3-0.1,0.5-0.3,0.6c-0.1,0.2-0.2,0.3-0.3,0.5c-0.1,0.1-0.3,0.1-0.4,0.1c-0.1,0-0.3-0.1-0.3-0.1s-0.1-0.3-0.1-0.5
			C32.8,45.6,32.8,45.4,32.9,45.1L32.9,45.1z M37.9,47.1c0.2,0,0.5,0,0.6,0c0.1-0.5,0.2-0.9,0.3-1.4c0.1-0.5,0.2-0.9,0.3-1.4
			c0.1-0.3,0.1-0.5,0.1-0.6s0-0.3-0.1-0.5S39,43.1,39,43C38.9,43,38.8,43,38.7,43c-0.2,0-0.4,0.1-0.5,0.2c-0.2,0.1-0.3,0.3-0.5,0.6
			c0-0.1,0-0.3-0.1-0.4c0-0.1-0.1-0.2-0.2-0.3C37.4,43,37.3,43,37.2,43c-0.1,0-0.2,0-0.3,0.1c-0.1,0.1-0.2,0.1-0.3,0.1
			c-0.1,0.1-0.2,0.1-0.3,0.2c-0.1,0.1-0.1,0.2-0.2,0.3l0,0c0.1-0.2,0.1-0.4,0.1-0.6c-0.2,0-0.5,0-0.6,0c-0.2,0.6-0.3,1.3-0.5,2
			c-0.2,0.6-0.3,1.4-0.5,2c0.2,0,0.5,0,0.6,0c0.1-0.4,0.2-0.7,0.3-1.1c0.1-0.4,0.2-0.7,0.3-1.1c0.1-0.1,0.1-0.3,0.1-0.4
			c0.1-0.1,0.1-0.2,0.2-0.3c0.1-0.1,0.1-0.1,0.2-0.2s0.1-0.1,0.2-0.1s0.1,0,0.1,0c0.1,0,0.1,0.1,0.1,0.1c0,0.1,0.1,0.1,0.1,0.2
			c0,0.1,0,0.2-0.1,0.3c-0.1,0.4-0.2,0.8-0.3,1.2c-0.1,0.4-0.2,0.8-0.3,1.2c0.2,0,0.5,0,0.6,0c0.1-0.4,0.2-0.7,0.3-1.1
			c0.1-0.4,0.2-0.7,0.3-1.1c0.1-0.1,0.1-0.3,0.1-0.4c0.1-0.1,0.1-0.2,0.2-0.3c0.1-0.1,0.1-0.1,0.2-0.2S38,44,38.1,44s0.1,0,0.1,0
			c0.1,0,0.1,0.1,0.1,0.1c0,0.1,0.1,0.1,0.1,0.2s0,0.2-0.1,0.3c-0.1,0.4-0.2,0.8-0.3,1.2C38.1,46.3,37.9,46.7,37.9,47.1L37.9,47.1z
			 M40.1,45.1c0.1-0.2,0.1-0.4,0.2-0.5c0.1-0.1,0.1-0.3,0.2-0.4c0.1-0.1,0.1-0.2,0.3-0.2c0.1-0.1,0.2-0.1,0.3-0.1
			c0.1,0,0.1,0,0.2,0.1c0.1,0.1,0.1,0.1,0.1,0.2c0.1,0.1,0.1,0.2,0.1,0.4c0,0.1,0,0.3-0.1,0.5c-0.1,0.2-0.1,0.4-0.1,0.5
			C41.1,45.8,41,45.9,41,46c-0.1,0.1-0.1,0.2-0.3,0.2c-0.1,0.1-0.2,0.1-0.3,0.1c-0.1,0-0.1,0-0.2-0.1c-0.1-0.1-0.1-0.1-0.1-0.2
			c-0.1-0.1-0.1-0.2-0.1-0.4C40,45.5,40.1,45.3,40.1,45.1L40.1,45.1z M38.6,48.7c0.2,0,0.5,0,0.6,0c0.1-0.3,0.1-0.6,0.2-1
			c0.1-0.3,0.1-0.6,0.2-1l0,0c0,0.1,0.1,0.3,0.1,0.3c0.1,0.1,0.1,0.2,0.2,0.2c0.1,0.1,0.2,0.1,0.3,0.1c0.1,0,0.3-0.1,0.5-0.1
			c0.1-0.1,0.3-0.3,0.5-0.5c0.1-0.2,0.3-0.5,0.4-0.7c0.1-0.3,0.2-0.6,0.3-0.9c0.1-0.3,0.1-0.6,0.1-0.9c0-0.3-0.1-0.5-0.1-0.6
			c-0.1-0.2-0.2-0.3-0.3-0.4c-0.1-0.1-0.3-0.1-0.5-0.1c-0.1,0-0.2,0-0.3,0.1c-0.1,0.1-0.2,0.1-0.3,0.2c-0.1,0.1-0.2,0.2-0.3,0.4l0,0
			c0.1-0.2,0.1-0.4,0.1-0.5c-0.2,0-0.5,0-0.6,0c-0.2,0.9-0.4,1.8-0.6,2.7C39.1,46.8,38.8,47.7,38.6,48.7L38.6,48.7z M41.9,47.1
			c0.2,0,0.5,0,0.6,0c0.1-0.3,0.1-0.6,0.2-0.9s0.1-0.6,0.2-0.8c0.1-0.3,0.1-0.5,0.2-0.6c0.1-0.2,0.2-0.3,0.3-0.4
			c0.1-0.1,0.3-0.1,0.4-0.1c0.1,0,0.1,0,0.2,0.1c0.1,0,0.1,0.1,0.2,0.1c0.1-0.4,0.2-0.8,0.3-1.2c-0.1,0-0.1,0-0.1,0
			c-0.1,0-0.1,0-0.1,0c-0.1,0-0.2,0-0.3,0.1c-0.1,0.1-0.1,0.1-0.3,0.1c-0.1,0.1-0.1,0.2-0.3,0.3c-0.1,0.1-0.2,0.3-0.3,0.4l0,0
			c0.1-0.3,0.1-0.5,0.2-0.8c-0.2,0-0.5,0-0.6,0c-0.1,0.6-0.3,1.3-0.5,2C42.2,45.8,42.1,46.4,41.9,47.1L41.9,47.1z M45.9,45.5
			c0,0.1-0.1,0.3-0.1,0.4c-0.1,0.1-0.1,0.2-0.2,0.3s-0.1,0.1-0.2,0.2c-0.1,0.1-0.1,0.1-0.2,0.1c-0.1,0-0.1,0.1-0.2,0.1
			s-0.1,0-0.2-0.1c-0.1-0.1-0.1-0.1-0.1-0.2c0-0.1,0-0.2,0-0.3s0.1-0.2,0.1-0.3c0.1-0.1,0.1-0.1,0.1-0.2c0.1-0.1,0.1-0.1,0.2-0.1
			c0.1,0,0.3-0.1,0.4-0.1c0.1,0,0.1,0,0.2-0.1c0.1,0,0.1-0.1,0.2-0.1C46,45.2,45.9,45.4,45.9,45.5L45.9,45.5z M45.1,44.3
			c0.1-0.1,0.1-0.3,0.1-0.3c0.1-0.1,0.1-0.1,0.1-0.2s0.1-0.1,0.1-0.1c0.1,0,0.1,0,0.2,0c0.1,0,0.2,0,0.3,0.1
			c0.1,0.1,0.1,0.1,0.1,0.1c0,0.1,0,0.1,0,0.3s-0.1,0.2-0.1,0.3c0,0.1-0.1,0.1-0.1,0.1s-0.1,0.1-0.2,0.1c-0.3,0.1-0.5,0.1-0.7,0.1
			c-0.1,0-0.2,0-0.3,0.1c-0.1,0-0.2,0.1-0.3,0.1c-0.1,0.1-0.1,0.1-0.3,0.2c-0.1,0.1-0.1,0.2-0.2,0.3s-0.1,0.3-0.1,0.5
			c-0.1,0.3-0.1,0.5-0.1,0.6c0,0.2,0.1,0.3,0.1,0.4c0.1,0.1,0.1,0.2,0.3,0.3c0.1,0.1,0.2,0.1,0.3,0.1c0.1,0,0.1,0,0.3,0
			c0.1,0,0.2-0.1,0.3-0.1c0.1-0.1,0.2-0.1,0.3-0.2c0.1-0.1,0.2-0.2,0.3-0.3c0,0.1,0,0.1,0,0.2c0,0.1,0,0.1,0,0.2c0.2,0,0.5,0,0.6,0
			c0-0.1,0-0.2,0-0.3c0-0.1,0.1-0.3,0.1-0.5c0.1-0.3,0.1-0.6,0.2-1c0.1-0.3,0.1-0.6,0.2-1c0-0.1,0.1-0.3,0.1-0.5c0-0.1,0-0.3,0-0.4
			c0-0.1-0.1-0.2-0.1-0.3c-0.1-0.1-0.2-0.1-0.3-0.2C46.3,43,46.1,43,45.9,43c-0.1,0-0.2,0-0.3,0c-0.1,0-0.2,0.1-0.3,0.1
			c-0.1,0.1-0.2,0.1-0.3,0.3s-0.2,0.3-0.3,0.4c-0.1,0.2-0.1,0.4-0.2,0.6C44.7,44.3,44.9,44.3,45.1,44.3L45.1,44.3z"/>
		<path class="st2" d="M18.2,42.7c0.4,0,0.8,0,1.1,0c0.1,0,0.1,0,0.1,0c0.1,0,0.1,0.1,0.1,0.1c0,0.1,0.1,0.1,0.1,0.2
			c0,0.1,0,0.2-0.1,0.3c-0.1,0.1-0.1,0.3-0.1,0.3s-0.1,0.1-0.2,0.2c-0.1,0.1-0.1,0.1-0.2,0.1C19,44,19,44.1,19,44.1
			c-0.4,0-0.8,0-1.2,0C17.9,43.6,18.1,43.2,18.2,42.7L18.2,42.7z M17.2,43.3h-7v0.6H17l-0.1,0.4h-6.7V45h6.5l-0.1,0.4h-6.4V46h6.2
			l-0.1,0.5h-6.1v0.6H16l0,0l0,0l0,0l0,0l0,0l0,0l0,0l0,0l0,0l0,0l0,0l0,0l0,0l0,0l0,0l0,0l0,0l0,0l0,0l0,0l0,0l0,0l0,0l0,0l0,0l0,0
			l0,0l0,0l0,0l0,0l0,0l0,0l0,0l0,0l0,0l0,0l0,0l0,0h0.4l0.6-2c0.3,0,0.7,0,1,0c0.1,0,0.1,0,0.2,0.1c0.1,0,0.1,0.1,0.1,0.1
			c0,0.1,0,0.2,0,0.3s-0.1,0.3-0.1,0.5c-0.1,0.1-0.1,0.3-0.1,0.4c0,0.1-0.1,0.2-0.1,0.3S18,46.8,18,46.9c0,0.1,0,0.1,0,0.2
			c0.3,0,0.6,0,1,0c0-0.1,0-0.1,0-0.3c0-0.1,0-0.2,0.1-0.3c0-0.1,0.1-0.3,0.1-0.3c0-0.1,0.1-0.2,0.1-0.3c0.1-0.1,0.1-0.2,0.1-0.3
			c0-0.1,0.1-0.3,0.1-0.4c0-0.1,0-0.3,0-0.3c0-0.1,0-0.2-0.1-0.3c0-0.1-0.1-0.1-0.1-0.1l0,0c0.2-0.1,0.4-0.3,0.6-0.5
			c0.1-0.2,0.3-0.5,0.4-0.8c0.1-0.1,0.1-0.3,0.1-0.4c0-0.1,0.1-0.3,0-0.4c0-0.1,0-0.3-0.1-0.4c-0.1-0.1-0.1-0.2-0.2-0.3
			c0.4-0.1,0.3-0.1,0.1-0.1c-0.8,0-1.5,0-2.4,0L17.2,43.3L17.2,43.3z M22.4,45.9c-0.1,0.2-0.3,0.3-0.4,0.4c-0.1,0.1-0.3,0.1-0.5,0.1
			c-0.1,0-0.3-0.1-0.3-0.1S21.1,46.1,21,46C21,45.9,21,45.8,21,45.7c0-0.1,0-0.2,0.1-0.3l0,0c0.8,0,1.5,0,2.4,0c0-0.1,0-0.1,0.1-0.1
			c0.1-0.5,0.3-1,0.3-1.3c0-0.4-0.1-0.6-0.3-0.8s-0.5-0.3-0.8-0.3c-0.3,0-0.5,0.1-0.7,0.1c-0.2,0.1-0.5,0.2-0.6,0.4
			c-0.2,0.2-0.4,0.4-0.5,0.7c-0.2,0.3-0.3,0.6-0.5,1s-0.2,0.7-0.2,1c0,0.3,0,0.5,0.1,0.7c0.1,0.2,0.2,0.3,0.4,0.4s0.4,0.1,0.6,0.1
			s0.5-0.1,0.7-0.1s0.5-0.3,0.6-0.5c0.2-0.2,0.4-0.5,0.6-0.8C23,45.9,22.6,45.9,22.4,45.9L22.4,45.9z M21.3,44.7L21.3,44.7
			c0-0.1,0-0.1,0.1-0.1c0.1-0.1,0.1-0.1,0.1-0.3c0.1-0.1,0.1-0.2,0.2-0.3c0.1-0.1,0.2-0.1,0.3-0.2c0.1-0.1,0.2-0.1,0.3-0.1
			c0.1,0,0.2,0,0.3,0.1c0.1,0.1,0.1,0.1,0.1,0.2c0.1,0.1,0.1,0.1,0.1,0.3c0,0.1,0,0.2,0,0.3s0,0.1-0.1,0.2l0,0
			C22.3,44.7,21.8,44.7,21.3,44.7L21.3,44.7z M24.6,45.1c0.1-0.2,0.1-0.4,0.2-0.5c0.1-0.1,0.2-0.3,0.3-0.4c0.1-0.1,0.2-0.2,0.3-0.2
			c0.1-0.1,0.2-0.1,0.3-0.1c0.1,0,0.2,0,0.3,0.1c0.1,0.1,0.1,0.1,0.2,0.2c0.1,0.1,0.1,0.2,0.1,0.4c0,0.1-0.1,0.3-0.1,0.5
			c-0.1,0.2-0.1,0.4-0.2,0.5c-0.1,0.1-0.2,0.3-0.3,0.4c-0.1,0.1-0.2,0.2-0.3,0.2c-0.1,0.1-0.2,0.1-0.3,0.1c-0.1,0-0.2,0-0.3-0.1
			s-0.1-0.1-0.2-0.2c-0.1-0.1-0.1-0.2-0.1-0.4C24.6,45.5,24.6,45.3,24.6,45.1L24.6,45.1z M25.5,47.1c0.3,0,0.5,0,0.8,0
			c0.3-0.9,0.6-1.9,0.8-2.8c0.3-0.9,0.6-1.9,0.8-2.8c-0.3,0-0.5,0-0.8,0c-0.1,0.3-0.2,0.6-0.3,1c-0.1,0.3-0.2,0.6-0.3,1l0,0
			c0-0.1-0.1-0.3-0.1-0.3c-0.1-0.1-0.1-0.2-0.3-0.2c-0.1-0.1-0.3-0.1-0.4-0.1c-0.2,0-0.4,0.1-0.6,0.1c-0.2,0.1-0.4,0.3-0.6,0.5
			s-0.3,0.5-0.5,0.7c-0.1,0.3-0.3,0.6-0.4,0.9c-0.1,0.4-0.2,0.6-0.2,1c0,0.3,0,0.5,0.1,0.6c0.1,0.2,0.2,0.3,0.3,0.4s0.3,0.1,0.5,0.1
			c0.1,0,0.3,0,0.4-0.1c0.1-0.1,0.3-0.1,0.4-0.2c0.1-0.1,0.3-0.3,0.4-0.4l0,0C25.6,46.8,25.6,47,25.5,47.1L25.5,47.1z"/>
	</g>
	<g>
		<g>
			<g>
				<polygon class="st3" points="14.3,37.9 13.6,37.9 14.1,35.3 14.7,35.3 				"/>
				<path class="st3" d="M13,35.3l-0.6,1.8l-0.1-0.4l0,0l-0.3-1.2c0,0,0-0.3-0.3-0.3h-1v0.1c0,0,0.3,0.1,0.7,0.3l0.6,2.3h0.7
					l1.1-2.6L13,35.3L13,35.3z"/>
				<path class="st3" d="M18.4,37.9H19l-0.5-2.6H18c-0.3,0-0.3,0.2-0.3,0.2l-1,2.4h0.7l0.1-0.4h0.8L18.4,37.9z M17.6,37l0.3-1l0.2,1
					H17.6z"/>
				<path class="st3" d="M16.6,35.9l0.1-0.6c0,0-0.3-0.1-0.6-0.1c-0.3,0-1.1,0.1-1.1,0.8c0,0.6,0.9,0.6,0.9,1c0,0.3-0.8,0.3-1.1,0.1
					l-0.1,0.6c0,0,0.3,0.1,0.8,0.1c0.5,0,1.2-0.3,1.2-0.9c0-0.6-1-0.7-1-1C15.7,35.7,16.3,35.7,16.6,35.9z"/>
			</g>
			<path class="st4" d="M12.3,36.7l-0.3-1.2c0,0,0-0.3-0.3-0.3h-1v0.1c0,0,0.5,0.1,1,0.5C12.2,36.3,12.3,36.7,12.3,36.7z"/>
		</g>
		<rect x="10.2" y="33.6" class="st5" width="9.6" height="6.1"/>
	</g>
	<g>
		<g>
			<path class="st6" d="M56.9,37c0.8,0,1.5-0.6,1.5-1.4c0-0.8-0.7-1.4-1.5-1.4h-0.6c-0.8,0-1.4,0.6-1.4,1.4c0,0.8,0.6,1.4,1.4,1.4
				H56.9z"/>
			<path class="st2" d="M56.5,36.3v-1.5c0.3,0.1,0.5,0.4,0.5,0.8C57.1,35.9,56.8,36.2,56.5,36.3 M55.4,35.5c0-0.3,0.2-0.6,0.5-0.8
				v1.5C55.6,36.2,55.4,35.9,55.4,35.5 M56.3,34.2c-0.7,0-1.3,0.6-1.3,1.3s0.6,1.3,1.3,1.3c0.7,0,1.3-0.6,1.3-1.3S57,34.2,56.3,34.2
				"/>
			<path class="st7" d="M53.4,37.9c0,0.1,0.1,0.1,0.1,0.1c0.3,0,0.5-0.3,0.5-0.5c0-0.3-0.2-0.5-0.5-0.5c-0.1,0-0.1,0-0.1,0V37.9z
				 M53.2,37.2c0-0.1-0.1-0.1-0.1-0.1V37c0.1,0,0.1,0,0.2,0c0.1,0,0.1,0,0.3,0c0.4,0,0.6,0.3,0.6,0.5c0,0.1-0.1,0.5-0.6,0.5
				c-0.1,0-0.1,0-0.2,0c-0.1,0-0.1,0-0.2,0V38c0.1,0,0.1,0,0.1-0.1V37.2z"/>
			<path class="st7" d="M54.3,37.2C54.3,37.2,54.3,37.1,54.3,37.2c-0.1-0.1,0-0.1,0-0.1C54.4,37,54.4,37,54.3,37.2
				C54.4,37.2,54.4,37.2,54.3,37.2 M54.2,38.1L54.2,38.1c0.1,0,0.1,0,0.1-0.1v-0.4c0-0.1,0-0.1-0.1-0.1l0,0c0.1,0,0.1-0.1,0.1-0.1
				l0,0l0,0V38c0,0.1,0.1,0.1,0.1,0.1l0,0v0.1c-0.1,0-0.1,0-0.1,0C54.3,38.1,54.3,38.1,54.2,38.1L54.2,38.1z"/>
			<path class="st7" d="M54.6,37.6c0-0.1,0-0.1-0.1-0.1l0,0c0.1,0,0.1-0.1,0.2-0.1l0,0v0.1c0.1-0.1,0.1-0.1,0.3-0.1
				c0.1,0,0.2,0.1,0.2,0.2V38c0,0.1,0.1,0.1,0.1,0.1l0,0v0.1c-0.1,0-0.1,0-0.1,0c-0.1,0-0.1,0-0.2,0v-0.1l0,0c0.1,0,0.1,0,0.1-0.1
				v-0.4c0-0.1-0.1-0.1-0.1-0.1S54.8,37.6,54.6,37.6l0.1,0.4c0,0.1,0.1,0.1,0.1,0.1l0,0v0.1c-0.1,0-0.1,0-0.1,0c-0.1,0-0.1,0-0.2,0
				v-0.1l0,0c0.1,0,0.1,0,0.1-0.1v-0.4H54.6z"/>
			<path class="st7" d="M55.7,37.6C55.7,37.6,55.7,37.6,55.7,37.6c0.1-0.1,0-0.2-0.1-0.2s-0.1,0.1-0.2,0.2H55.7z M55.4,37.7
				L55.4,37.7c0,0.2,0.1,0.3,0.2,0.3c0.1,0,0.1-0.1,0.2-0.1l0,0c-0.1,0.1-0.1,0.2-0.3,0.2c-0.3,0-0.3-0.3-0.3-0.3
				c0-0.3,0.2-0.4,0.3-0.4s0.3,0.1,0.3,0.3l0,0l0,0L55.4,37.7L55.4,37.7z"/>
			<path class="st7" d="M55.9,38.1L55.9,38.1c0.1,0,0.1,0,0.1-0.1v-0.5c0-0.1-0.1-0.1-0.1-0.1l0,0c0.1-0.1,0.2-0.1,0.2-0.1l0,0v0.1
				l0,0c0.1-0.1,0.1-0.1,0.2-0.1c0.1,0,0.1,0,0.1,0.1s0,0.1-0.1,0.1s-0.1-0.1-0.1-0.1c0,0-0.1,0.1-0.1,0.1v0.3c0,0.1,0,0.1,0.1,0.1
				h0.1v0.1c-0.1,0-0.1,0-0.2,0C56,38.1,55.9,38.1,55.9,38.1L55.9,38.1z"/>
			<path class="st7" d="M56.5,37.9c0,0.1,0.1,0.2,0.2,0.2c0.1,0,0.1-0.1,0.1-0.1c0-0.2-0.3-0.1-0.3-0.4c0-0.1,0.1-0.2,0.3-0.2
				c0.1,0,0.1,0,0.2,0.1v0.1h-0.1c0-0.1-0.1-0.1-0.2-0.1c-0.1,0-0.1,0.1-0.1,0.1c0,0.2,0.3,0.1,0.3,0.4c0,0.1-0.1,0.2-0.3,0.2
				c-0.1,0-0.1,0-0.2-0.1L56.5,37.9L56.5,37.9z"/>
			<path class="st7" d="M58.3,37.4L58.3,37.4c-0.1-0.2-0.2-0.3-0.4-0.3c-0.2,0-0.5,0.1-0.5,0.5c0,0.3,0.2,0.5,0.5,0.5
				c0.1,0,0.3-0.1,0.3-0.3h0.1L58.2,38c-0.1,0.1-0.3,0.1-0.3,0.1c-0.3,0-0.6-0.3-0.6-0.6c0-0.3,0.3-0.5,0.6-0.5
				c0.1,0,0.3,0.1,0.3,0.1L58.3,37.4z"/>
			<path class="st7" d="M58.3,38.1L58.3,38.1c0.1,0,0.1,0,0.1-0.1v-0.8c0-0.1,0-0.1-0.1-0.1l0,0c0.1,0,0.1-0.1,0.1-0.1s0,0,0.1,0
				l0,0v1c0,0.1,0.1,0.1,0.1,0.1l0,0v0.1c-0.1,0-0.1,0-0.1,0C58.4,38.1,58.3,38.1,58.3,38.1L58.3,38.1z"/>
			<path class="st7" d="M59.2,38C59.2,38.1,59.3,38.1,59.2,38c0.1,0,0.1,0,0.1,0l0,0C59.3,38,59.2,38.1,59.2,38L59.2,38L59.2,38
				c-0.1,0-0.2,0.1-0.3,0.1c-0.1,0-0.2-0.1-0.2-0.2v-0.4c0-0.1,0-0.1-0.1-0.1l0,0c0.1,0,0.2,0,0.2,0s0,0,0,0.1v0.4
				c0,0.1,0,0.2,0.1,0.2C59,38.1,59.1,38,59.2,38l-0.1-0.4c0,0-0.1-0.1-0.1-0.1l0,0c0.1,0,0.2,0,0.3,0l0,0L59.2,38L59.2,38z"/>
			<path class="st7" d="M59.5,37.9c0,0.1,0.1,0.1,0.1,0.1c0.1,0,0.3-0.1,0.3-0.3s-0.1-0.3-0.3-0.3c-0.1,0-0.1,0.1-0.1,0.1V37.9z
				 M59.5,37.6c0.1-0.1,0.1-0.1,0.2-0.1c0.2,0,0.3,0.1,0.3,0.3s-0.1,0.4-0.4,0.4c-0.1,0-0.2-0.1-0.2-0.1l-0.1,0.1l0,0
				c0-0.1,0-0.2,0-0.3v-0.6c0-0.1,0-0.1-0.1-0.1l0,0c0.1,0,0.1-0.1,0.1-0.1s0,0,0.1,0l0,0L59.5,37.6L59.5,37.6z"/>
			<path class="st7" d="M53.1,39L53.1,39C53.2,39,53.2,39,53.1,39l0.1-0.5c0-0.1,0-0.1-0.1-0.1l0,0l0,0c0,0,0.1,0,0.1,0
				c0.1,0,0.1,0,0.1,0l0,0l0,0c0,0-0.1,0-0.1,0.1v0.5c0,0.1,0,0.1,0.1,0.1l0,0l0,0c-0.1,0-0.1,0-0.1,0C53.2,39,53.1,39,53.1,39
				L53.1,39z"/>
			<path class="st7" d="M53.4,39L53.4,39L53.4,39C53.3,39,53.3,39,53.4,39l-0.1-0.5c0-0.1,0.1-0.1,0.1-0.1l0,0l0,0
				c-0.1,0-0.1,0-0.1,0s-0.1,0-0.1,0l0,0l0,0c0,0,0.1,0,0.1,0.1v0.5c0,0.1-0.1,0.1-0.1,0.1l0,0l0,0c0,0,0.1,0,0.1,0
				C53.2,39,53.3,39,53.4,39 M53.4,39c-0.1,0-0.1,0-0.1,0s-0.1,0-0.1,0l0,0l0,0l0,0l0,0l0,0l0,0c0,0,0.1,0,0.1-0.1v-0.5
				c0-0.1,0-0.1-0.1-0.1l0,0l0,0l0,0l0,0c0,0,0.1,0,0.1,0s0.1,0,0.1,0l0,0l0,0l0,0l0,0l0,0c0,0-0.1,0-0.1,0.1L53.4,39
				C53.3,39,53.3,39,53.4,39L53.4,39L53.4,39L53.4,39L53.4,39z"/>
			<path class="st7" d="M53.9,38.8L53.9,38.8v-0.3c0-0.1-0.1-0.1-0.1-0.1l0,0l0,0c0.1,0,0.1,0,0.1,0s0.1,0,0.1,0l0,0l0,0
				c-0.1,0-0.1,0-0.1,0.1V39V39l0,0l-0.5-0.5v0.3c0,0.1,0,0.1,0.1,0.1l0,0l0,0c-0.1,0-0.1,0-0.1,0s-0.1,0-0.1,0l0,0l0,0
				c0.1,0,0.1-0.1,0.1-0.1v-0.3c0-0.1-0.1-0.1-0.1-0.1l0,0l0,0h0.1h0.1L53.9,38.8z"/>
			<path class="st7" d="M53.9,38.8L53.9,38.8L53.9,38.8L53.9,38.8z M53.9,38.8L53.9,38.8L53.9,38.8z M53.9,39L53.9,39L53.9,39v-0.5
				c0-0.1,0.1-0.1,0.1-0.1l0,0l0,0c0,0-0.1,0-0.1,0s-0.1,0-0.1,0l0,0l0,0c0,0,0.1,0,0.1,0.1v0.3l0,0l0,0l-0.3-0.4h-0.1h-0.1l0,0l0,0
				c0.1,0,0.1,0,0.1,0.1v0.3c0,0.1,0,0.1-0.1,0.1l0,0l0,0c0.1,0,0.1,0,0.1,0s0.1,0,0.1,0l0,0l0,0c-0.1,0-0.1,0-0.1-0.1v-0.3L53.9,39
				z M53.9,39L53.9,39l-0.5-0.5v0.3c0,0.1,0,0.1,0.1,0.1l0,0l0,0l0,0l0,0c-0.1,0-0.1,0-0.1,0s-0.1,0-0.1,0l0,0l0,0l0,0l0,0l0,0
				c0.1,0,0.1-0.1,0.1-0.1v-0.3c0-0.1-0.1-0.1-0.1-0.1l0,0l0,0l0,0l0,0h0.1h0.1l0.4,0.4v-0.3c0-0.1-0.1-0.1-0.1-0.1l0,0l0,0l0,0l0,0
				c0.1,0,0.1,0,0.1,0s0.1,0,0.1,0l0,0l0,0l0,0l0,0l0,0c-0.1,0-0.1,0-0.1,0.1V39C53.9,39,53.9,39,53.9,39L53.9,39L53.9,39z"/>
			<path class="st7" d="M54.1,38.5C54.1,38.5,54.1,38.5,54.1,38.5L54.1,38.5L54.1,38.5L54.1,38.5L54.1,38.5
				C54.1,38.5,54.1,38.5,54.1,38.5l0.4-0.1h0.1l0,0v0.1v0.1l0,0c0,0,0-0.1-0.1-0.1h-0.1v0.5c0,0.1,0,0.1,0.1,0.1l0,0l0,0
				c0,0-0.1,0-0.1,0s-0.1,0-0.1,0l0,0l0,0c0.1,0,0.1,0,0.1-0.1v-0.5H54.1z"/>
			<path class="st7" d="M54.5,39c0,0-0.1,0-0.1,0s-0.1,0-0.1,0l0,0l0,0l0,0l0,0l0,0c0.1,0,0.1,0,0.1-0.1v-0.5h-0.1l0,0l0,0h0.1v0.5
				c0,0.1,0,0.1-0.1,0.1l0,0l0,0c0.1,0,0.1,0,0.1,0S54.5,39,54.5,39L54.5,39L54.5,39c-0.1,0-0.1-0.1-0.1-0.1v-0.4h0.1
				c0.1,0,0.1,0.1,0.1,0.1l0,0v-0.1v-0.1l0,0c0,0,0,0-0.1,0h-0.5l0,0H54l0,0v0.1v0.1l0,0c0-0.1,0-0.1,0.1-0.1l0,0l0,0
				c-0.1,0-0.1,0-0.1,0.1l0,0l0,0l0,0l0,0v-0.1v-0.1l0,0l0,0l0,0l0,0c0,0,0,0,0.1,0l0,0h0.5h0.1l0,0l0,0l0,0l0,0v0.1v0.1l0,0l0,0
				l0,0l0,0c0,0,0-0.1-0.1-0.1h-0.1L54.5,39C54.4,39,54.4,39,54.5,39L54.5,39L54.5,39L54.5,39L54.5,39z"/>
			<path class="st7" d="M54.6,39L54.6,39C54.7,39,54.7,39,54.6,39l0.1-0.5c0-0.1,0-0.1-0.1-0.1l0,0l0,0c0.1,0,0.1,0,0.2,0
				c0.1,0,0.1,0,0.2,0c0,0.1,0,0.1,0,0.1l0,0c0-0.1,0-0.1-0.1-0.1h-0.1v0.2h0.1c0.1,0,0.1,0,0.1-0.1l0,0v0.1v0.1l0,0
				c0-0.1,0-0.1-0.1-0.1h-0.1v0.2c0,0.1,0.1,0.1,0.1,0.1c0.1,0,0.1,0,0.2-0.1l0,0c0,0.1,0,0.1,0,0.1c-0.1,0-0.1,0-0.2,0
				C54.8,38.9,54.7,39,54.6,39L54.6,39z"/>
			<path class="st7" d="M55.1,39c0-0.1,0-0.1,0-0.1l0,0c0,0.1-0.1,0.1-0.2,0.1c-0.1,0-0.1,0-0.1-0.1v-0.2h0.1c0.1,0,0.1,0.1,0.1,0.1
				l0,0v-0.1v-0.1l0,0c0,0.1,0,0.1-0.1,0.1h-0.1v-0.3h0.1c0.1,0,0.1,0.1,0.1,0.1l0,0v-0.1c0,0,0,0,0-0.1c-0.1,0-0.1,0-0.2,0
				c-0.1,0-0.1,0-0.2,0l0,0l0,0c0,0,0.1,0,0.1,0.1v0.5c0,0.1-0.1,0.1-0.1,0.1l0,0l0,0c0.1,0,0.1,0,0.2,0S55,39,55.1,39 M55.1,39
				c-0.1,0-0.1,0-0.2,0c-0.1,0-0.2,0-0.2,0l0,0l0,0l0,0l0,0l0,0l0,0c0,0,0.1,0,0.1-0.1v-0.5c0-0.1,0-0.1-0.1-0.1l0,0l0,0l0,0l0,0
				c0.1,0,0.1,0,0.2,0c0.1,0,0.1,0,0.2,0l0,0l0,0c0,0,0,0,0,0.1v0.1l0,0l0,0l0,0l0,0c0-0.1,0-0.1-0.1-0.1h-0.1v0.2H55
				c0.1,0,0.1,0,0.1-0.1l0,0l0,0l0,0l0,0v0.1v0.1l0,0l0,0l0,0l0,0c0-0.1,0-0.1-0.1-0.1h-0.1v0.2c0,0.1,0.1,0.1,0.1,0.1
				c0.1,0,0.1,0,0.2-0.1l0,0l0,0l0,0l0,0C55.1,38.9,55.1,39,55.1,39L55.1,39L55.1,39z"/>
			<path class="st7" d="M55.3,38.7L55.3,38.7c0.1,0,0.2,0,0.2-0.1c0-0.1-0.1-0.1-0.1-0.1h-0.1C55.3,38.5,55.3,38.7,55.3,38.7z
				 M55.2,38.5C55.2,38.5,55.2,38.5,55.2,38.5L55.2,38.5L55.2,38.5C55.2,38.5,55.2,38.5,55.2,38.5c0.1-0.1,0.1-0.1,0.2-0.1
				c0.1,0,0.2,0,0.2,0.1c0,0.1-0.1,0.1-0.1,0.1l0.1,0.2c0,0.1,0.1,0.1,0.1,0.1l0,0h-0.1h-0.1c-0.1-0.1-0.1-0.2-0.2-0.3h-0.1v0.2
				c0,0.1,0,0.1,0.1,0.1l0,0l0,0c-0.1,0-0.1,0-0.1,0s-0.1,0-0.1,0l0,0l0,0c0,0,0.1,0,0.1-0.1L55.2,38.5L55.2,38.5z"/>
			<path class="st7" d="M55.4,38.7c0.1,0,0.1,0,0.1-0.1c0-0.1-0.1-0.1-0.1-0.1h-0.1L55.4,38.7L55.4,38.7z M55.3,38.7L55.3,38.7v-0.3
				l0,0c0,0,0,0,0.1,0s0.1,0.1,0.1,0.1C55.5,38.7,55.4,38.7,55.3,38.7L55.3,38.7z M55.3,38.7L55.3,38.7L55.3,38.7
				c0.1,0.1,0.2,0.2,0.2,0.3h0.1h0.1l0,0c-0.1,0-0.1,0-0.1-0.1l-0.1-0.2l0,0c0.1,0,0.1-0.1,0.1-0.1c0-0.1-0.1-0.1-0.2-0.1
				c-0.1,0-0.1,0-0.1,0c-0.1,0-0.1,0-0.1,0l0,0l0,0c0,0,0.1,0,0.1,0.1v0.4c0,0.1,0,0.1-0.1,0.1l0,0l0,0c0.1,0,0.1,0,0.1,0
				c0.1,0,0.1,0,0.1,0l0,0l0,0c-0.1,0-0.1,0-0.1-0.1V38.7L55.3,38.7z M55.7,39L55.7,39h-0.1c-0.1-0.1-0.1-0.2-0.2-0.3h-0.1v0.2
				c0,0.1,0,0.1,0.1,0.1l0,0l0,0l0,0l0,0c-0.1,0-0.1,0-0.1,0c-0.1,0-0.1,0-0.1,0l0,0l0,0l0,0l0,0l0,0c0,0,0.1,0,0.1-0.1v-0.4
				c0-0.1,0-0.1-0.1-0.1l0,0l0,0l0,0l0,0c0,0,0.1,0,0.1,0c0.1,0,0.1,0,0.1,0c0.1,0,0.2,0,0.2,0.1c0,0.1-0.1,0.1-0.1,0.1l0.1,0.2
				C55.6,39,55.7,39,55.7,39L55.7,39L55.7,39L55.7,39L55.7,39z"/>
			<path class="st7" d="M56.3,38.8L56.3,38.8v-0.3c0-0.1-0.1-0.1-0.1-0.1l0,0l0,0c0.1,0,0.1,0,0.1,0s0.1,0,0.1,0l0,0l0,0
				c-0.1,0-0.1,0-0.1,0.1V39V39l0,0l-0.5-0.5v0.3c0,0.1,0,0.1,0.1,0.1l0,0l0,0c-0.1,0-0.1,0-0.1,0s-0.1,0-0.1,0l0,0l0,0
				c0.1,0,0.1-0.1,0.1-0.1v-0.3c0-0.1-0.1-0.1-0.1-0.1l0,0l0,0h0.1h0.1L56.3,38.8z"/>
			<path class="st7" d="M56.3,38.8L56.3,38.8L56.3,38.8L56.3,38.8z M56.3,38.8L56.3,38.8L56.3,38.8z M56.3,39L56.3,39L56.3,39v-0.5
				c0-0.1,0.1-0.1,0.1-0.1l0,0l0,0h-0.1c-0.1,0-0.1,0-0.1,0l0,0l0,0c0,0,0.1,0,0.1,0.1v0.3l0,0l0,0l-0.3-0.4h-0.1h-0.1l0,0l0,0
				c0.1,0,0.1,0,0.1,0.1v0.3c0,0.1,0,0.1-0.1,0.1l0,0l0,0c0.1,0,0.1,0,0.1,0s0.1,0,0.1,0l0,0l0,0c-0.1,0-0.1,0-0.1-0.1v-0.3L56.3,39
				z M56.3,39L56.3,39l-0.5-0.5v0.3c0,0.1,0,0.1,0.1,0.1l0,0l0,0l0,0l0,0c-0.1,0-0.1,0-0.1,0s-0.1,0-0.1,0l0,0l0,0l0,0l0,0l0,0
				c0.1,0,0.1-0.1,0.1-0.1v-0.3c0.1-0.1,0-0.1,0-0.1l0,0l0,0l0,0l0,0h0.1h0.1l0.4,0.4v-0.3c0-0.1-0.1-0.1-0.1-0.1l0,0l0,0l0,0l0,0
				c0.1,0,0.1,0,0.1,0c0.1,0,0.1,0,0.1,0l0,0l0,0l0,0l0,0l0,0c-0.1,0-0.1,0-0.1,0.1L56.3,39C56.3,39,56.3,39,56.3,39L56.3,39
				L56.3,39z"/>
			<path class="st7" d="M56.6,38.5L56.6,38.5l-0.1,0.3h0.1L56.6,38.5z M56.5,38.9L56.5,38.9C56.5,39,56.5,39,56.5,38.9L56.5,38.9
				L56.5,38.9C56.5,39,56.5,39,56.5,38.9L56.4,39l0,0l0,0C56.4,39,56.5,39,56.5,38.9l0.1-0.3c0,0,0-0.1,0-0.1c0,0,0.1,0,0.1-0.1l0,0
				l0,0l0,0l0.1,0.5v0.1c0,0,0,0.1,0.1,0.1l0,0l0,0c-0.1,0-0.1,0-0.1,0S56.6,39,56.5,38.9L56.5,38.9L56.5,38.9l0.1,0.1v-0.1v-0.1
				L56.5,38.9L56.5,38.9z"/>
			<path class="st7" d="M56.6,38.5L56.6,38.5L56.6,38.5z M56.6,38.8h0.1l-0.1-0.2L56.6,38.8z M56.5,38.8l0.1-0.3l0,0l0,0l0,0l0,0
				l0,0l0,0l0,0l0.1,0.3H56.5z M56.7,39c0.1,0,0.1,0,0.1,0s0.1,0,0.1,0l0,0l0,0c0,0-0.1,0-0.1-0.1v-0.1l-0.2-0.4l0,0l0,0l0,0l0,0
				c0,0-0.1,0-0.1,0.1c0,0,0,0.1,0,0.1L56.5,39c0,0.1-0.1,0.1-0.1,0.1l0,0l0,0h0.1h0.1l0,0l0,0h-0.1V39l0,0l0,0V39H56.7L56.7,39
				C56.8,38.9,56.8,38.9,56.7,39C56.8,39,56.7,39,56.7,39L56.7,39L56.7,39z M57,39c-0.1,0-0.1,0-0.1,0s-0.1,0-0.1,0l0,0l0,0l0,0l0,0
				l0,0h0.1c0,0,0,0,0-0.1v-0.1h-0.2v0.1V39c0,0,0,0,0.1,0l0,0l0,0l0,0l0,0c-0.1,0-0.1,0-0.1,0h-0.1l0,0l0,0l0,0l0,0l0,0
				c0,0,0.1,0,0.1-0.1l0.1-0.4c0,0,0-0.1,0.1-0.1c0,0,0.1,0,0.1-0.1l0,0l0,0l0,0l0.1,0.5C56.8,38.9,56.9,38.9,57,39
				C56.9,39,56.9,39,57,39L57,39L57,39L57,39L57,39z"/>
			<path class="st7" d="M57,38.5C56.9,38.5,56.9,38.5,57,38.5L57,38.5L57,38.5L57,38.5L57,38.5C56.9,38.5,57,38.5,57,38.5l0.4-0.1
				h0.1l0,0v0.1v0.1l0,0c0,0,0-0.1-0.1-0.1h-0.1v0.5c0,0.1,0,0.1,0.1,0.1l0,0l0,0c0,0-0.1,0-0.1,0S57,39,57,39l0,0l0,0
				c0.1,0,0.1,0,0.1-0.1v-0.5H57z"/>
			<path class="st7" d="M57.3,39c0,0-0.1,0-0.1,0S57,39,57,39l0,0l0,0l0,0l0,0l0,0c0.1,0,0.1,0,0.1-0.1v-0.5H57l0,0l0,0h0.1v0.5
				c0,0.1,0,0.1-0.1,0.1l0,0l0,0c0,0,0.1,0,0.1,0S57.3,39,57.3,39L57.3,39L57.3,39c-0.1,0-0.1-0.1-0.1-0.1v-0.4h0.1
				c0.1,0,0.1,0.1,0.1,0.1l0,0v-0.1v-0.1l0,0c0,0,0,0-0.1,0h-0.5l0,0h-0.1l0,0v0.1v0.1l0,0c0-0.1,0-0.1,0.1-0.1l0,0l0,0
				c-0.1,0-0.1,0-0.1,0.1l0,0l0,0l0,0l0,0v-0.1v-0.1l0,0l0,0l0,0l0,0c0,0,0,0,0.1,0l0,0h0.5h0.1l0,0l0,0l0,0l0,0v0.1v0.1l0,0l0,0
				l0,0l0,0c0,0,0-0.1-0.1-0.1h-0.1L57.3,39C57.2,39,57.2,39,57.3,39L57.3,39L57.3,39L57.3,39L57.3,39z"/>
			<path class="st7" d="M57.5,39L57.5,39C57.5,39,57.5,39,57.5,39l0.1-0.5c0-0.1,0-0.1-0.1-0.1l0,0l0,0c0,0,0.1,0,0.1,0
				c0.1,0,0.1,0,0.1,0l0,0l0,0c0,0-0.1,0-0.1,0.1v0.5c0,0.1,0,0.1,0.1,0.1l0,0l0,0c-0.1,0-0.1,0-0.1,0C57.5,39,57.5,39,57.5,39
				L57.5,39z"/>
			<path class="st7" d="M57.7,39L57.7,39L57.7,39C57.7,39,57.7,39,57.7,39l-0.1-0.5c0,0,0,0,0.1,0l0,0l0,0c-0.1,0-0.1,0-0.1,0
				s-0.1,0-0.1,0l0,0l0,0c0,0,0.1,0,0.1,0.1V39c0,0.1-0.1,0.1-0.1,0.1l0,0l0,0c0,0,0.1,0,0.1,0C57.6,39,57.7,39,57.7,39 M57.7,39
				c-0.1,0-0.1,0-0.1,0s-0.1,0-0.1,0l0,0l0,0l0,0l0,0l0,0l0,0c0,0,0.1,0,0.1-0.1v-0.5c0-0.1,0-0.1-0.1-0.1l0,0l0,0l0,0l0,0
				c0,0,0.1,0,0.1,0s0.1,0,0.1,0l0,0l0,0l0,0l0,0l0,0c0,0-0.1,0-0.1,0.1L57.7,39C57.7,39,57.7,39,57.7,39L57.7,39L57.7,39L57.7,39
				L57.7,39z"/>
			<path class="st7" d="M58.1,39c0.1,0,0.2-0.1,0.2-0.3s-0.1-0.3-0.2-0.3c-0.1,0-0.2,0.1-0.2,0.3C57.9,38.8,57.9,39,58.1,39
				 M58.1,38.4c0.2,0,0.3,0.1,0.3,0.3c0,0.2-0.1,0.3-0.3,0.3c-0.2,0-0.3-0.1-0.3-0.3C57.7,38.5,57.9,38.4,58.1,38.4"/>
			<path class="st7" d="M57.9,38.7c0-0.1,0.1-0.3,0.2-0.3c0.1,0,0.2,0.1,0.2,0.3c0,0.1,0,0.3-0.2,0.3l0,0l0,0c0.1,0,0.2-0.1,0.2-0.3
				c0-0.1-0.1-0.3-0.2-0.3C57.9,38.5,57.9,38.6,57.9,38.7c0,0.1,0.1,0.3,0.2,0.3l0,0l0,0C57.9,39,57.9,38.8,57.9,38.7 M57.7,38.7
				c0-0.2,0.1-0.3,0.3-0.3l0,0l0,0C57.9,38.4,57.7,38.5,57.7,38.7c0,0.2,0.1,0.3,0.3,0.3c0.2,0,0.3-0.1,0.3-0.3
				c0-0.2-0.1-0.3-0.3-0.3l0,0l0,0c0.2,0,0.3,0.1,0.3,0.3c0,0.2-0.1,0.3-0.3,0.3C57.9,39,57.7,38.9,57.7,38.7"/>
			<path class="st7" d="M58.9,38.8L58.9,38.8v-0.3c0-0.1-0.1-0.1-0.1-0.1l0,0l0,0c0.1,0,0.1,0,0.1,0s0.1,0,0.1,0l0,0l0,0
				c-0.1,0-0.1,0-0.1,0.1V39V39l0,0l-0.5-0.5v0.3c0,0.1,0,0.1,0.1,0.1l0,0l0,0c-0.1,0-0.1,0-0.1,0s-0.1,0-0.1,0l0,0l0,0
				c0.1,0,0.1-0.1,0.1-0.1v-0.3c0-0.1-0.1-0.1-0.1-0.1l0,0l0,0h0.1h0.1L58.9,38.8z"/>
			<path class="st7" d="M58.9,38.8L58.9,38.8L58.9,38.8L58.9,38.8z M58.9,38.8L58.9,38.8L58.9,38.8z M58.9,39L58.9,39L58.9,39v-0.5
				c0.1-0.1,0.1-0.1,0.1-0.1l0,0l0,0c-0.1,0-0.1,0-0.1,0s-0.1,0-0.1,0l0,0l0,0c0,0,0.1,0,0.1,0.1v0.3l0,0l0,0l-0.3-0.4h-0.1h-0.1
				l0,0l0,0c0.1,0,0.1,0,0.1,0.1v0.3c0,0.1,0,0.1-0.1,0.1l0,0l0,0c0.1,0,0.1,0,0.1,0s0.1,0,0.1,0l0,0l0,0c-0.1,0-0.1,0-0.1-0.1v-0.3
				L58.9,39z M59,39L59,39l-0.5-0.5v0.3c0,0.1,0,0.1,0.1,0.1l0,0l0,0l0,0l0,0c-0.1,0-0.1,0-0.1,0s-0.1,0-0.1,0l0,0l0,0l0,0l0,0l0,0
				c0.1,0,0.1-0.1,0.1-0.1v-0.3c0-0.1-0.1-0.1-0.1-0.1l0,0l0,0l0,0l0,0h0.1h0.1l0.4,0.4v-0.3c0-0.1-0.1-0.1-0.1-0.1l0,0l0,0l0,0l0,0
				c0.1,0,0.1,0,0.1,0s0.1,0,0.1,0l0,0l0,0l0,0l0,0l0,0c-0.1,0-0.1,0-0.1,0.1V39C59,39,59,39,59,39L59,39L59,39z"/>
			<path class="st7" d="M59.3,38.5L59.3,38.5l-0.1,0.3h0.1L59.3,38.5z M59.2,38.9L59.2,38.9C59.2,39,59.2,39,59.2,38.9L59.2,38.9
				L59.2,38.9C59.2,39,59.2,39,59.2,38.9L59,39l0,0l0,0C59.1,39,59.1,39,59.2,38.9l0.1-0.3c0,0,0-0.1,0-0.1c0,0,0.1,0,0.1-0.1l0,0
				l0,0l0,0l0.1,0.5v0.1c0,0,0,0.1,0.1,0.1l0,0l0,0c-0.1,0-0.1,0-0.1,0S59.3,39,59.2,38.9L59.2,38.9L59.2,38.9l0.1,0.1v-0.1v-0.1
				L59.2,38.9L59.2,38.9z"/>
			<path class="st7" d="M59.3,38.5L59.3,38.5L59.3,38.5z M59.2,38.8h0.1l-0.1-0.2L59.2,38.8z M59.2,38.8l0.1-0.3l0,0l0,0l0,0l0,0
				l0,0l0,0l0,0l0.1,0.3H59.2z M59.4,39c0.1,0,0.1,0,0.1,0s0.1,0,0.1,0l0,0l0,0c0,0-0.1,0-0.1-0.1v-0.1l-0.2-0.4l0,0l0,0l0,0l0,0
				c0,0-0.1,0-0.1,0.1c0,0,0,0.1,0,0.1L59.2,39c0,0.1-0.1,0.1-0.1,0.1l0,0l0,0h0.1h0.1l0,0l0,0c0,0-0.1,0-0.1-0.1V39l0,0l0,0v-0.1
				L59.4,39L59.4,39C59.4,38.9,59.4,38.9,59.4,39C59.4,39,59.4,39,59.4,39L59.4,39L59.4,39z M59.6,39c-0.1,0-0.1,0-0.1,0
				s-0.1,0-0.1,0l0,0l0,0l0,0l0,0l0,0h0.1c0,0,0,0,0-0.1v-0.1h-0.2v0.1V39c0,0,0,0,0.1,0l0,0l0,0l0,0l0,0c-0.1,0-0.1,0-0.1,0h-0.1
				l0,0l0,0l0,0l0,0l0,0c0,0,0.1,0,0.1-0.1l0.1-0.4c0,0,0-0.1,0.1-0.1c0,0,0.1,0,0.1-0.1l0,0l0,0l0,0l0.1,0.5
				C59.5,38.9,59.5,38.9,59.6,39C59.5,39,59.5,39,59.6,39L59.6,39L59.6,39L59.6,39L59.6,39z"/>
			<path class="st7" d="M59.8,38.9C59.8,39,59.8,39,59.8,38.9c0.1,0.1,0.1,0.1,0.1,0.1c0.1,0,0.1,0,0.1-0.1v-0.1l0,0
				c0,0.1,0,0.1,0,0.1C59.9,39,59.9,39,59.8,38.9C59.7,39,59.7,39,59.6,39l0,0l0,0c0,0,0.1,0,0.1-0.1v-0.4c0-0.1,0-0.1-0.1-0.1l0,0
				l0,0c0.1,0,0.1,0,0.1,0s0.1,0,0.1,0l0,0l0,0c0,0-0.1,0-0.1,0.1L59.8,38.9L59.8,38.9z"/>
			<path class="st7" d="M60.1,39c0-0.1,0-0.1,0-0.1l0,0V39L60.1,39l-0.1,0c0,0,0,0-0.1,0c0,0-0.1,0-0.1-0.1v-0.5
				c0-0.1,0-0.1,0.1-0.1l0,0l0,0c-0.1,0-0.1,0-0.1,0s-0.1,0-0.1,0l0,0l0,0c0,0,0.1,0,0.1,0.1v0.4c0,0.1-0.1,0.1-0.1,0.1l0,0l0,0
				c0.1,0,0.1,0,0.2,0C59.9,39,60,39,60.1,39 M60.1,39c-0.1,0-0.1,0-0.2,0c-0.1,0-0.1,0-0.2,0l0,0l0,0l0,0l0,0l0,0
				c0,0,0.1,0,0.1-0.1v-0.4c0-0.1,0-0.1-0.1-0.1l0,0l0,0l0,0l0,0c0.1,0,0.1,0,0.1,0c0.1,0,0.1,0,0.1,0l0,0l0,0l0,0l0,0l0,0
				c0,0-0.1,0-0.1,0.1V39c0,0,0,0.1,0.1,0.1C59.9,39,59.9,39,60.1,39L60.1,39C60.1,39,60.1,39,60.1,39L60.1,39L60.1,39L60.1,39
				L60.1,39L60.1,39C60.1,38.9,60.1,39,60.1,39L60.1,39L60.1,39z"/>
			<path class="st7" d="M60.1,38.5L60.1,38.5C60.1,38.5,60.1,38.5,60.1,38.5C60.1,38.5,60.1,38.5,60.1,38.5L60.1,38.5L60.1,38.5z
				 M60.1,38.5L60.1,38.5L60.1,38.5L60.1,38.5L60.1,38.5L60.1,38.5L60.1,38.5L60.1,38.5C60.1,38.5,60.1,38.5,60.1,38.5L60.1,38.5
				L60.1,38.5L60.1,38.5L60.1,38.5C60.1,38.5,60.1,38.5,60.1,38.5L60.1,38.5L60.1,38.5L60.1,38.5L60.1,38.5L60.1,38.5z M60.1,38.6
				C60.1,38.6,60.1,38.5,60.1,38.6c0.1-0.1,0.1-0.1,0-0.1S60,38.5,60.1,38.6C60,38.5,60.1,38.6,60.1,38.6 M60.1,38.4
				C60.1,38.4,60.1,38.5,60.1,38.4c0.1,0.1,0,0.1,0,0.1C60,38.5,60,38.5,60.1,38.4C60,38.5,60,38.4,60.1,38.4"/>
		</g>
		<rect x="51.8" y="33.6" class="st5" width="9.6" height="6.1"/>
	</g>
	<g>
		<g>
			<path class="st8" d="M43,39.5L43,39.5C43,39.5,43,39.5,43,39.5C43,39.5,43,39.5,43,39.5L43,39.5L43,39.5L43,39.5L43,39.4H43h0.1
				C43,39.4,43,39.4,43,39.5C43,39.5,43,39.5,43,39.5L43,39.5C43,39.5,43,39.5,43,39.5L43,39.5L43,39.5z M43,39.4L43,39.4L43,39.4
				L43,39.4L43,39.4L43,39.4L43,39.4L43,39.4z M43.1,39.5c0-0.1-0.1-0.1-0.1-0.1c-0.1,0-0.1,0.1-0.1,0.1c0,0.1,0.1,0.1,0.1,0.1
				C43,39.6,43.1,39.6,43.1,39.5L43.1,39.5L43.1,39.5z M43,39.5c0,0.1-0.1,0.1-0.1,0.1c-0.1,0-0.1-0.1-0.1-0.1
				c0-0.1,0.1-0.1,0.1-0.1C43,39.4,43,39.4,43,39.5L43,39.5z"/>
			<path class="st8" d="M49.3,37.6c0,0.1-0.1,0.2-0.3,0.2h-0.3v-0.1H49h0.1c0,0,0,0,0-0.1v-0.1c0,0,0,0-0.1,0c-0.1,0-0.3,0-0.3-0.2
				c0-0.1,0.1-0.2,0.3-0.2h0.3v0.1H49h-0.1c0,0,0,0,0,0.1c0,0,0,0.1,0.1,0.1H49h0.1c0.1,0,0.1,0,0.2,0.1
				C49.3,37.4,49.3,37.5,49.3,37.6L49.3,37.6L49.3,37.6z M48.6,37.4c-0.1-0.1-0.1-0.1-0.2-0.1h-0.1h-0.1c0,0-0.1,0-0.1-0.1v-0.1h0.1
				h0.3v-0.1h-0.3c-0.2,0-0.3,0.1-0.3,0.2c0,0.2,0.2,0.2,0.3,0.2h0.1c0,0,0,0,0,0.1v0.1h-0.1H48v0.1h0.3c0.2,0,0.3-0.1,0.3-0.2
				C48.6,37.5,48.6,37.4,48.6,37.4L48.6,37.4L48.6,37.4z M47.9,37.6h-0.4v-0.1h0.4v-0.1h-0.4v-0.1h0.4v-0.1h-0.6v0.7h0.6V37.6
				L47.9,37.6z M47.2,37.1C47.1,37.1,47,37,47,37h-0.4v0.7h0.2v-0.3H47c0.1,0,0.1,0,0.1,0c0,0.1,0,0.1,0,0.1v0.1h0.2v-0.1
				c0-0.1,0-0.1,0-0.1l-0.1-0.1c0.1,0,0.1-0.1,0.1-0.2C47.3,37.2,47.2,37.1,47.2,37.1L47.2,37.1L47.2,37.1z M46.2,37h-0.5l-0.2,0.3
				L45.3,37h-0.7v0.7h0.6l0.2-0.3l0.2,0.3h0.3v-0.3h0.2c0.1,0,0.3-0.1,0.3-0.3C46.5,37.1,46.3,37,46.2,37L46.2,37L46.2,37z M47,37.4
				L47,37.4h-0.3v-0.1H47H47C47,37.2,47.1,37.2,47,37.4C47.1,37.3,47,37.4,47,37.4L47,37.4L47,37.4z M46.2,37.4H46v-0.2h0.2
				c0.1,0,0.1,0,0.1,0.1C46.3,37.4,46.3,37.4,46.2,37.4L46.2,37.4L46.2,37.4z M45.5,37.4l0.3-0.3v0.6L45.5,37.4L45.5,37.4z
				 M45.2,37.6h-0.5v-0.1h0.4v-0.1h-0.4v-0.1h0.5l0.2,0.2L45.2,37.6L45.2,37.6z M48.8,36.5h-0.3L48.3,36v0.5h-0.3l-0.1-0.1h-0.3
				l-0.1,0.1h-0.2c-0.1,0-0.2,0-0.3-0.1c-0.1-0.1-0.1-0.1-0.1-0.3c0-0.1,0-0.2,0.1-0.3c0.1-0.1,0.1-0.1,0.3-0.1h0.1V36h-0.1
				c-0.1,0-0.1,0-0.1,0.1c0,0-0.1,0.1-0.1,0.1c0,0.1,0,0.1,0.1,0.2c0,0,0.1,0.1,0.1,0.1h0.1l0.3-0.6h0.3l0.3,0.6v-0.6h0.3l0.3,0.5
				v-0.5h0.2V36.5L48.8,36.5z M46.8,35.8h-0.2v0.7h0.2V35.8L46.8,35.8z M46.4,35.9c-0.1,0-0.1,0-0.2,0h-0.4v0.6h0.2v-0.3h0.2
				c0.1,0,0.1,0,0.1,0c0,0.1,0,0.1,0,0.1v0.1h0.2v-0.1c0-0.1,0-0.1,0-0.1l-0.1-0.1c0.1,0,0.1-0.1,0.1-0.2
				C46.5,35.9,46.5,35.9,46.4,35.9L46.4,35.9L46.4,35.9z M45.7,36.4h-0.4v-0.1h0.4v-0.1h-0.4V36h0.4v-0.1h-0.6v0.6h0.6V36.4
				L45.7,36.4z M45,35.8h-0.3l-0.2,0.5l-0.2-0.5h-0.3v0.6l-0.3-0.6h-0.3l-0.3,0.7h0.2l0.1-0.1h0.4l0.1,0.1h0.3v-0.6l0.3,0.6h0.1
				l0.3-0.6v0.6h0.2L45,35.8L45,35.8z M47.8,36.3L47.7,36l-0.1,0.3H47.8L47.8,36.3z M46.3,36.1L46.3,36.1h-0.3V36h0.2h0.1
				C46.3,36,46.3,36,46.3,36.1C46.3,36.1,46.3,36.1,46.3,36.1L46.3,36.1L46.3,36.1z M43.5,36.3l0.1-0.3l0.1,0.3H43.5L43.5,36.3z
				 M49.2,33.6h-6.1v2.6l0.2-0.5h0.5l0.1,0.1v-0.1h0.5l0.1,0.3l0.1-0.3h1.6c0.1,0,0.1,0,0.2,0.1v-0.1h0.5v0.1
				c0.1-0.1,0.2-0.1,0.3-0.1h0.6l0.1,0.1v-0.1h0.5l0.1,0.1v-0.1h0.5v1h-0.5l0-0.2v0.1h-0.6l-0.1-0.1h-0.1l-0.1,0.1h-0.3
				c-0.1,0-0.2,0-0.3-0.1v0.1h-0.7v-0.3v-0.1l0,0v0.3h-1.5v-0.1l-0.1,0.1h-0.3l-0.1-0.1v0.1h-0.6v-0.1h-0.1l-0.1,0.2h-0.3v3h6.1
				v-1.8c-0.1,0-0.1,0.1-0.3,0.1h-0.5v-0.1c-0.1,0.1-0.1,0.1-0.3,0.1h-1.4v-0.3l0,0l0,0v0.3h-0.5v-0.3c-0.1,0.1-0.1,0.1-0.3,0.1
				h-0.1V38h-0.6l-0.1-0.1L45.3,38h-0.9v-1h0.9l0.1,0.1l0.1-0.1h0.6c0.1,0,0.2,0,0.3,0.1V37h0.5c0.1,0,0.1,0,0.3,0.1V37H48v0.1
				c0.1-0.1,0.1-0.1,0.2-0.1h0.5v0.1c0.1-0.1,0.1-0.1,0.2-0.1h0.3L49.2,33.6L49.2,33.6z"/>
		</g>
		<rect x="41.4" y="33.6" class="st5" width="9.7" height="6.1"/>
	</g>
	<g>
		<g>
			<polygon class="st9" points="31,33.6 40.7,33.6 40.7,39.7 31,39.7 			"/>
			<polygon class="st10" points="31.5,37.2 32.5,35.6 40.2,35.6 39.1,37.2 			"/>
			<polygon class="st2" points="31.8,37.1 32.6,35.8 32.9,35.8 32.9,36.7 33.5,35.8 33.7,35.8 33.7,37.1 33.5,37.1 33.5,36.2 
				32.9,37.1 32.6,37.1 32.6,36.2 32.1,37.1 			"/>
			<path class="st2" d="M33.8,37.1l0.6-1.3h0.2l0.6,1.3h-0.3l-0.1-0.3h-0.5l-0.1,0.3H33.8L33.8,37.1z M34.3,36.5h0.3l-0.1-0.3
				L34.3,36.5L34.3,36.5z"/>
			<path class="st2" d="M35.6,36.5c0,0.1,0,0.2,0,0.3c0.2,0,0.3,0,0.5,0c-0.2,0.4-0.8,0.2-0.8-0.2c0-0.5,0.6-0.6,0.8-0.3
				c0.1,0,0.2,0,0.3,0c-0.1-0.3-0.3-0.5-0.6-0.5s-0.7,0.3-0.7,0.6c0,0.5,0.3,0.7,0.7,0.7c0.3,0,0.7-0.3,0.7-0.7
				C36.2,36.5,35.9,36.5,35.6,36.5L35.6,36.5z"/>
			<polygon class="st2" points="36.5,37.1 36.8,37.1 36.8,36.3 37.4,37.1 37.6,37.1 37.6,35.8 37.4,35.8 37.4,36.7 36.8,35.8 
				36.5,35.8 			"/>
			<path class="st2" d="M38.1,36.8h0.5l0.1,0.3H39l-0.5-1.3h-0.2l-0.6,1.3h0.3L38.1,36.8L38.1,36.8z M38.4,36.2
				c0,0.1-0.1,0.3-0.1,0.3h0.3L38.4,36.2L38.4,36.2z"/>
			<polygon class="st10" points="33.8,33.6 32.6,35.5 40.3,35.5 40.7,34.8 40.7,34.8 40.3,35.5 32.7,35.5 33.9,33.6 			"/>
			<path class="st2" d="M39.5,35.8c0.1,0,0.2,0.1,0.2,0.2s-0.1,0.2-0.2,0.2s-0.2-0.1-0.2-0.2S39.4,35.8,39.5,35.8L39.5,35.8z
				 M39.5,35.9c0.1,0,0.1,0.1,0.1,0.1c0,0.1-0.1,0.1-0.1,0.1c-0.1,0-0.1-0.1-0.1-0.1C39.4,35.9,39.4,35.9,39.5,35.9L39.5,35.9z"/>
			<path class="st2" d="M39.4,36.1v-0.2h0.1c0,0,0,0,0.1,0l0,0l0,0l0,0c0,0,0,0-0.1,0l0,0l0,0v0.1l0,0v-0.1l0,0l0,0l0,0l0,0l0,0
				L39.4,36.1L39.4,36.1L39.4,36.1z M39.4,36L39.4,36C39.5,36,39.5,36,39.4,36L39.4,36L39.4,36L39.4,36C39.5,35.9,39.5,35.9,39.4,36
				L39.4,36L39.4,36L39.4,36z"/>
		</g>
		<rect x="31" y="33.6" class="st5" width="9.7" height="6.1"/>
	</g>
	<g>
		<g>
			<polygon class="st11" points="20.5,39.7 30.1,39.7 30.1,33.6 20.5,33.6 			"/>
			<path class="st12" d="M25.3,38.6c0.5,0.5,1.1,0.7,1.7,0.7c1.5,0,2.6-1.2,2.6-2.6c0-1.4-1.2-2.6-2.6-2.6c-0.6,0-1.3,0.3-1.7,0.7
				c-0.5,0.5-0.8,1.2-0.8,1.9C24.5,37.4,24.8,38.1,25.3,38.6L25.3,38.6z"/>
			<path class="st12" d="M29.4,38.1C29.4,38,29.5,38,29.4,38.1c0.1-0.1,0.1,0,0.1,0C29.5,38.1,29.5,38.1,29.4,38.1
				C29.4,38.2,29.4,38.1,29.4,38.1L29.4,38.1z M29.5,38.1C29.5,38.1,29.5,38.1,29.5,38.1c0.1-0.1,0.1-0.1,0-0.1S29.4,38,29.5,38.1
				C29.4,38.1,29.4,38.1,29.5,38.1L29.5,38.1z M29.5,38.1L29.5,38.1L29.5,38.1L29.5,38.1L29.5,38.1C29.5,38.1,29.5,38.1,29.5,38.1
				C29.5,38.1,29.5,38.1,29.5,38.1L29.5,38.1L29.5,38.1L29.5,38.1L29.5,38.1L29.5,38.1L29.5,38.1z M29.5,38.1L29.5,38.1L29.5,38.1
				L29.5,38.1L29.5,38.1L29.5,38.1L29.5,38.1L29.5,38.1L29.5,38.1z"/>
			<path class="st13" d="M26.2,36.3c0-0.1,0-0.2-0.1-0.3h-1.6c0-0.1,0.1-0.2,0.1-0.3h1.5c0-0.1-0.1-0.2-0.1-0.3h-1.2
				c0.1-0.1,0.1-0.2,0.1-0.3h0.9c-0.1-0.1-0.1-0.2-0.2-0.3H25c0.1-0.1,0.2-0.2,0.3-0.3c-0.5-0.5-1.1-0.7-1.7-0.7
				c-1.5,0-2.6,1.2-2.6,2.6s1.2,2.6,2.6,2.6c0.7,0,1.3-0.3,1.7-0.7l0,0c0.1-0.1,0.2-0.2,0.3-0.3H25c-0.1-0.1-0.1-0.2-0.2-0.3h0.9
				c0.1-0.1,0.1-0.2,0.1-0.3h-1.2c-0.1-0.1-0.1-0.2-0.1-0.3h1.5c0-0.1,0.1-0.2,0.1-0.3c0-0.1,0.1-0.2,0.1-0.3c0-0.1,0-0.2,0-0.3
				C26.2,36.5,26.2,36.5,26.2,36.3L26.2,36.3z"/>
			<path class="st2" d="M29.4,37.2C29.4,37.2,29.5,37.2,29.4,37.2c0.1-0.1,0.1,0,0.1,0C29.5,37.3,29.5,37.3,29.4,37.2
				C29.4,37.3,29.4,37.3,29.4,37.2L29.4,37.2z M29.5,37.3C29.5,37.3,29.5,37.3,29.5,37.3c0.1-0.1,0.1-0.1,0-0.1S29.4,37.2,29.5,37.3
				C29.4,37.3,29.4,37.3,29.5,37.3L29.5,37.3z M29.5,37.3L29.5,37.3L29.5,37.3L29.5,37.3L29.5,37.3C29.5,37.2,29.5,37.2,29.5,37.3
				C29.5,37.2,29.5,37.2,29.5,37.3L29.5,37.3L29.5,37.3L29.5,37.3L29.5,37.3L29.5,37.3L29.5,37.3z M29.5,37.2L29.5,37.2L29.5,37.2
				L29.5,37.2L29.5,37.2L29.5,37.2L29.5,37.2L29.5,37.2L29.5,37.2z"/>
			<path class="st11" d="M24.4,37.4c-0.1,0-0.1,0.1-0.2,0.1c-0.1,0-0.2-0.1-0.2-0.3c0,0,0-0.1,0-0.1v-0.1v-0.1l0.1-0.8h0.3v0.2h0.2
				l-0.1,0.3h-0.2L24.3,37c0,0,0,0,0,0.1c0,0.1,0,0.1,0.1,0.1c0.1,0,0.1,0,0.1,0L24.4,37.4L24.4,37.4z"/>
			<path class="st11" d="M25.3,37.4c-0.1,0-0.2,0.1-0.3,0.1c-0.3,0-0.5-0.2-0.5-0.5c0-0.4,0.2-0.6,0.5-0.6c0.3,0,0.4,0.1,0.4,0.4
				c0,0.1,0,0.1-0.1,0.3h-0.6l0,0c0,0.1,0.1,0.2,0.3,0.2c0.1,0,0.2,0,0.3-0.1V37.4L25.3,37.4z M25.2,36.7
				C25.2,36.7,25.2,36.7,25.2,36.7c0-0.1-0.1-0.2-0.1-0.2c-0.1,0-0.1,0.1-0.2,0.2H25.2L25.2,36.7z"/>
			<polygon class="st11" points="22.3,37.4 22,37.4 22.1,36.4 21.8,37.4 21.6,37.4 21.5,36.4 21.4,37.4 21.1,37.4 21.3,36.1 
				21.7,36.1 21.7,36.9 22.1,36.1 22.5,36.1 			"/>
			<path class="st11" d="M23,36.9C22.9,36.9,22.9,36.9,23,36.9c-0.2,0-0.3,0.1-0.3,0.1c0,0.1,0.1,0.1,0.1,0.1
				C22.9,37.2,23,37,23,36.9L23,36.9z M23.2,37.4h-0.3v-0.1c-0.1,0.1-0.1,0.1-0.3,0.1c-0.1,0-0.3-0.1-0.3-0.3c0-0.1,0-0.1,0-0.1
				c0.1-0.2,0.2-0.3,0.5-0.3c0,0,0.1,0,0.1,0c0-0.1,0-0.1,0-0.1c0-0.1-0.1-0.1-0.2-0.1c-0.1,0-0.2,0-0.3,0h-0.1l0,0l0.1-0.3
				c0.1-0.1,0.3-0.1,0.3-0.1c0.3,0,0.4,0.1,0.4,0.3c0,0.1,0,0.1,0,0.2l-0.1,0.4v0.1v0.1L23.2,37.4L23.2,37.4L23.2,37.4z"/>
			<path class="st11" d="M26.7,36.3c0.1,0,0.1,0,0.3,0.1l0.1-0.3c0,0,0,0-0.1,0h-0.1c-0.1,0-0.1,0-0.1,0c-0.1,0-0.2,0-0.3,0.1
				c-0.1,0-0.1,0.1-0.2,0.1l0,0l-0.3,0.2v-0.1h-0.3l-0.1,1.1h0.3l0.1-0.6c0,0,0.1-0.1,0.1-0.1c0.1-0.1,0.1-0.1,0.1-0.1l0,0
				c0,0.1,0,0.1,0,0.2c0,0.4,0.2,0.6,0.5,0.6c0.1,0,0.1,0,0.3-0.1l0.1-0.3c-0.1,0.1-0.1,0.1-0.2,0.1c-0.2,0-0.3-0.1-0.3-0.3
				C26.3,36.5,26.5,36.3,26.7,36.3L26.7,36.3z"/>
			<path class="st11" d="M29.1,36.1L29,36.5c-0.1-0.1-0.1-0.1-0.3-0.1c-0.1,0-0.3,0.1-0.4,0.3l0,0l-0.2-0.1v-0.1h-0.3l-0.2,1.1h0.3
				l0.1-0.6c0,0,0.1-0.1,0.1-0.1c0.1-0.1,0.1-0.1,0.1-0.1c0,0.1-0.1,0.2-0.1,0.3c0,0.3,0.1,0.5,0.3,0.5c0.1,0,0.2-0.1,0.3-0.1v0.1
				H29L29.1,36.1L29.1,36.1L29.1,36.1z M28.8,37.2c-0.1,0-0.1-0.1-0.1-0.2c0-0.2,0.1-0.4,0.2-0.4c0.1,0,0.1,0.1,0.1,0.2
				C29,37,28.9,37.2,28.8,37.2L28.8,37.2z"/>
			<path class="st11" d="M27.5,36.9C27.4,36.9,27.4,36.9,27.5,36.9c-0.2,0-0.3,0.1-0.3,0.1c0,0.1,0.1,0.1,0.1,0.1
				C27.4,37.2,27.5,37,27.5,36.9L27.5,36.9z M27.7,37.4h-0.3v-0.1c-0.1,0.1-0.1,0.1-0.3,0.1c-0.1,0-0.3-0.1-0.3-0.3
				c0-0.3,0.2-0.4,0.5-0.4c0,0,0.1,0,0.1,0c0-0.1,0-0.1,0-0.1c0-0.1-0.1-0.1-0.2-0.1c-0.1,0-0.2,0-0.3,0H27l0,0l0.1-0.3
				c0.1-0.1,0.3-0.1,0.3-0.1c0.3,0,0.4,0.1,0.4,0.3c0,0.1,0,0.1,0,0.2l-0.1,0.4v0.1v0.1L27.7,37.4L27.7,37.4L27.7,37.4z"/>
			<path class="st11" d="M23.8,36.5c0.1,0,0.1,0,0.2,0l0.1-0.3c-0.1,0-0.2,0-0.3,0c-0.3,0-0.5,0.2-0.5,0.4c0,0.1,0.1,0.3,0.2,0.3
				c0.1,0.1,0.1,0.1,0.1,0.1c0,0.1-0.1,0.1-0.2,0.1c-0.1,0-0.1,0-0.3-0.1v0.3l0,0h0.1h0.1c0.1,0,0.1,0,0.2,0c0.3,0,0.5-0.1,0.5-0.4
				c0-0.1-0.1-0.3-0.2-0.3c-0.1-0.1-0.1-0.1-0.1-0.1C23.7,36.6,23.7,36.5,23.8,36.5L23.8,36.5z"/>
			<path class="st2" d="M27.1,36L27,36.3c-0.1-0.1-0.2-0.1-0.3-0.1c-0.2,0-0.4,0.2-0.4,0.5c0,0.2,0.1,0.3,0.3,0.3
				c0.1,0,0.1,0,0.3-0.1l-0.1,0.3c-0.1,0-0.2,0.1-0.3,0.1c-0.3,0-0.5-0.2-0.5-0.6c0-0.5,0.3-0.8,0.6-0.8c0.1,0,0.1,0,0.1,0H27
				C27,36,27.1,36,27.1,36L27.1,36z"/>
			<path class="st2" d="M26.2,36.2C26.2,36.2,26.1,36.2,26.2,36.2c-0.1,0-0.2,0.1-0.3,0.2v-0.2h-0.3l-0.2,1.1h0.3
				c0.1-0.6,0.1-0.8,0.3-0.8l0,0C26.1,36.4,26.1,36.3,26.2,36.2L26.2,36.2L26.2,36.2z"/>
			<path class="st2" d="M24.5,37.3c-0.1,0-0.1,0.1-0.2,0.1c-0.1,0-0.3-0.1-0.3-0.3c0,0,0-0.1,0-0.1v-0.1v-0.1l0.1-0.8h0.3v0.1h0.1
				l0.1,0.4h-0.1L24.4,37V37c0,0.1,0,0.1,0.1,0.1c0.1,0,0.1,0,0.1,0L24.5,37.3L24.5,37.3z"/>
			<path class="st2" d="M23.4,36.6c0,0.1,0.1,0.3,0.2,0.3c0.1,0.1,0.1,0.1,0.1,0.1c0,0.1-0.1,0.1-0.2,0.1c-0.1,0-0.1,0-0.3-0.1
				l-0.1,0.3l0,0h0.1h0.1c0.1,0,0.1,0,0.1,0c0.3,0,0.5-0.1,0.5-0.4c0-0.1-0.1-0.3-0.2-0.3c-0.1-0.1-0.1-0.1-0.1-0.1
				c0-0.1,0.1-0.1,0.1-0.1s0.1,0,0.2,0l0.1-0.3c-0.1,0-0.2,0-0.3,0C23.5,36.2,23.4,36.4,23.4,36.6L23.4,36.6z"/>
			<path class="st2" d="M29.3,37.3H29v-0.1c-0.1,0.1-0.1,0.1-0.3,0.1c-0.2,0-0.3-0.2-0.3-0.5c0-0.4,0.2-0.6,0.5-0.6
				c0.1,0,0.2,0.1,0.3,0.1l0.1-0.4h0.3L29.3,37.3L29.3,37.3z M28.8,37c0.1,0,0.3-0.1,0.3-0.4c0-0.1-0.1-0.2-0.1-0.2
				c-0.1,0-0.2,0.1-0.2,0.4C28.7,37,28.8,37,28.8,37L28.8,37z"/>
			<path class="st2" d="M25.4,37.3c-0.1,0-0.2,0.1-0.3,0.1c-0.3,0-0.5-0.2-0.5-0.5c0-0.4,0.2-0.6,0.5-0.6c0.3,0,0.4,0.1,0.4,0.4
				c0,0.1,0,0.1,0,0.3h-0.6l0,0c0,0.1,0.1,0.2,0.3,0.2c0.1,0,0.2,0,0.3-0.1L25.4,37.3L25.4,37.3z M25.2,36.7
				C25.2,36.7,25.2,36.6,25.2,36.7c0-0.1-0.1-0.2-0.1-0.2c-0.1,0-0.1,0.1-0.2,0.2H25.2L25.2,36.7z"/>
			<polygon class="st2" points="22.3,37.3 22.1,37.3 22.3,36.3 21.9,37.3 21.7,37.3 21.7,36.3 21.5,37.3 21.2,37.3 21.4,36 21.9,36 
				21.9,36.8 22.1,36 22.6,36 			"/>
			<path class="st2" d="M23,36.8L23,36.8c-0.2,0-0.3,0.1-0.3,0.2c0,0.1,0.1,0.1,0.1,0.1C23,37.1,23,37,23,36.8L23,36.8z M23.3,37.3
				H23v-0.1c-0.1,0.1-0.2,0.1-0.3,0.1c-0.1,0-0.3-0.1-0.3-0.3c0-0.3,0.2-0.4,0.5-0.4c0,0,0.1,0,0.1,0v-0.1c0-0.1-0.1-0.1-0.2-0.1
				c-0.1,0-0.2,0-0.3,0h-0.1l0,0l0.1-0.3c0.1-0.1,0.3-0.1,0.3-0.1c0.3,0,0.4,0.1,0.4,0.3c0,0.1,0,0.1,0,0.2L23.3,37V37v0.1
				L23.3,37.3L23.3,37.3L23.3,37.3z"/>
			<path class="st2" d="M27.5,36.8L27.5,36.8c-0.2,0-0.3,0.1-0.3,0.2c0,0.1,0.1,0.1,0.1,0.1C27.5,37.1,27.5,37,27.5,36.8L27.5,36.8z
				 M27.7,37.3h-0.3v-0.1c-0.1,0.1-0.2,0.1-0.3,0.1c-0.1,0-0.3-0.1-0.3-0.3c0-0.3,0.2-0.4,0.5-0.4c0,0,0.1,0,0.1,0v-0.1
				c0-0.1-0.1-0.1-0.2-0.1c-0.1,0-0.2,0-0.3,0H27l0,0l0.1-0.3c0.1-0.1,0.3-0.1,0.3-0.1c0.3,0,0.4,0.1,0.4,0.3c0,0.1,0,0.1,0,0.2
				L27.7,37V37v0.1L27.7,37.3L27.7,37.3L27.7,37.3z"/>
			<path class="st2" d="M28.5,36.2L28.5,36.2c-0.1,0-0.2,0.1-0.3,0.2v-0.2H28l-0.2,1.1h0.3c0.1-0.6,0.1-0.8,0.3-0.8l0,0
				C28.4,36.4,28.5,36.3,28.5,36.2L28.5,36.2L28.5,36.2z"/>
		</g>
		<rect x="20.5" y="33.6" class="st5" width="9.7" height="6.1"/>
	</g>
	<ellipse class="st14" cx="32.1" cy="32.1" rx="0.4" ry="0.4"/>
	<ellipse class="st14" cx="29.4" cy="32.1" rx="0.4" ry="0.4"/>
	<ellipse class="st14" cx="26.8" cy="32.1" rx="0.4" ry="0.4"/>
	<ellipse class="st14" cx="24.1" cy="32.1" rx="0.4" ry="0.4"/>
	<ellipse class="st14" cx="21.5" cy="32.1" rx="0.4" ry="0.4"/>
	<ellipse class="st14" cx="18.8" cy="32.1" rx="0.4" ry="0.4"/>
	<ellipse class="st14" cx="16.1" cy="32.1" rx="0.4" ry="0.4"/>
	<ellipse class="st14" cx="13.5" cy="32.1" rx="0.4" ry="0.4"/>
	<ellipse class="st14" cx="10.8" cy="32.1" rx="0.4" ry="0.4"/>
	<ellipse class="st14" cx="8.2" cy="32.1" rx="0.4" ry="0.4"/>
	<ellipse class="st14" cx="37.4" cy="32.1" rx="0.4" ry="0.4"/>
	<ellipse class="st14" cx="34.7" cy="32.1" rx="0.4" ry="0.4"/>
	<ellipse class="st14" cx="71.8" cy="32.1" rx="0.4" ry="0.4"/>
	<ellipse class="st14" cx="69.2" cy="32.1" rx="0.4" ry="0.4"/>
	<ellipse class="st14" cx="66.5" cy="32.1" rx="0.4" ry="0.4"/>
	<ellipse class="st14" cx="63.9" cy="32.1" rx="0.4" ry="0.4"/>
	<ellipse class="st14" cx="61.2" cy="32.1" rx="0.4" ry="0.4"/>
	<ellipse class="st14" cx="58.6" cy="32.1" rx="0.4" ry="0.4"/>
	<ellipse class="st14" cx="55.9" cy="32.1" rx="0.4" ry="0.4"/>
	<ellipse class="st14" cx="53.3" cy="32.1" rx="0.4" ry="0.4"/>
	<ellipse class="st14" cx="50.6" cy="32.1" rx="0.4" ry="0.4"/>
	<ellipse class="st14" cx="47.9" cy="32.1" rx="0.4" ry="0.4"/>
	<ellipse class="st14" cx="45.3" cy="32.1" rx="0.4" ry="0.4"/>
	<ellipse class="st14" cx="42.6" cy="32.1" rx="0.4" ry="0.4"/>
	<ellipse class="st14" cx="40" cy="32.1" rx="0.4" ry="0.4"/>
	<ellipse class="st14" cx="77.1" cy="32.1" rx="0.4" ry="0.4"/>
	<ellipse class="st14" cx="74.5" cy="32.1" rx="0.4" ry="0.4"/>
	<ellipse class="st14" cx="95.7" cy="32.1" rx="0.4" ry="0.4"/>
	<ellipse class="st14" cx="93" cy="32.1" rx="0.4" ry="0.4"/>
	<ellipse class="st14" cx="90.4" cy="32.1" rx="0.4" ry="0.4"/>
	<ellipse class="st14" cx="87.7" cy="32.1" rx="0.4" ry="0.4"/>
	<ellipse class="st14" cx="85" cy="32.1" rx="0.4" ry="0.4"/>
	<ellipse class="st14" cx="82.4" cy="32.1" rx="0.4" ry="0.4"/>
	<ellipse class="st14" cx="79.7" cy="32.1" rx="0.4" ry="0.4"/>
	<path class="st15" d="M80,13.7c0-0.1,0.2-0.7,0.3-0.8l7-6.9c0.2-0.2,0.6-0.2,0.8,0l7.9,7.9c0.2,0.2,0.2,0.6,0,0.8l-7,6.9
		c-0.1,0.1-0.8,0.3-0.9,0.3h-7.6c-0.3,0-0.6-0.3-0.6-0.6L80,13.7L80,13.7z"/>
	<path class="st16" d="M80,13.7c0-0.1,0.2-0.7,0.3-0.8l7-6.9c0.2-0.2,0.6-0.2,0.8,0l7.9,7.9c0.2,0.2,0.2,0.6,0,0.8l-7,6.9
		c-0.1,0.1-0.8,0.3-0.9,0.3h-7.6c-0.3,0-0.6-0.3-0.6-0.6L80,13.7L80,13.7z"/>
	<path class="st2" d="M83.1,14.3c0.6,0,1.1,0.5,1.1,1.2c0,0.6-0.5,1.2-1.1,1.2c-0.6,0-1.1-0.5-1.1-1.2C82,14.8,82.5,14.3,83.1,14.3z
		 M82.1,18.5V17c0.4,0.4,0.6,0.5,1.2,0.5c1,0,1.9-0.9,1.9-2s-0.8-1.9-1.9-1.9c-0.5,0-0.9,0.2-1.2,0.6v-0.5h-0.8v4.9H82.1z"/>
	<rect x="85.3" y="12.4" class="st2" width="0.9" height="4.9"/>
	<path class="st2" d="M89,15.5c0,0.7-0.3,1.1-0.8,1.1s-0.8-0.4-0.8-1.1v-1.9h-0.9v2.2c0,0.6,0.1,1,0.5,1.2c0.3,0.3,0.6,0.4,1.1,0.4
		s0.6-0.1,1-0.5v0.4h0.8v-3.7H89L89,15.5L89,15.5z"/>
	<path class="st2" d="M89.9,16.1c0,0.3,0.1,0.5,0.1,0.6c0.2,0.4,0.6,0.7,1.2,0.7c0.8,0,1.4-0.6,1.4-1.3c0-0.3-0.1-0.6-0.3-0.8
		c-0.1-0.1-0.4-0.2-0.7-0.3L91.3,15c-0.3-0.1-0.4-0.2-0.4-0.3c0-0.2,0.1-0.3,0.3-0.3s0.3,0.1,0.3,0.3h0.9c0-0.6-0.6-1.2-1.2-1.2
		c-0.7,0-1.2,0.5-1.2,1.2c0,0.3,0.1,0.6,0.3,0.8c0.2,0.2,0.3,0.2,0.7,0.3c0.5,0.2,0.6,0.3,0.6,0.5s-0.2,0.4-0.4,0.4
		c-0.3,0-0.4-0.1-0.5-0.5H89.9z"/>
	<polygon class="st17" points="13.5,25 15.7,17.6 17.9,25 19.5,25 23.7,13.5 20.8,13.5 18.6,20.5 16.8,13.5 14.6,13.5 12.7,20.5 
		10.6,13.5 7.7,13.5 11.8,25 	"/>
	<path class="st17" d="M24.7,18.3c0.4-1.6,1.7-2.7,3.3-2.7c1.6,0,2.8,1,3.2,2.7H24.7z M33.9,19.1c0-3.3-2.7-6.1-5.9-6.1
		c-3.4,0-6.1,2.8-6.1,6.3c0,3.4,2.7,6.1,6.1,6.1c2.5,0,4.8-1.7,5.5-4h-3c-0.6,1-1.4,1.5-2.6,1.5c-1.4,0-2.7-1-3-2.4h8.9
		C33.9,19.8,33.9,19.5,33.9,19.1z"/>
	<path class="st17" d="M39.5,15.7c1.9,0,3.4,1.5,3.4,3.6c0,2.1-1.4,3.6-3.3,3.6c-2,0-3.5-1.6-3.5-3.7C36.1,17.2,37.7,15.7,39.5,15.7
		z M36.1,25v-1.4c1.1,1.2,2.3,1.7,3.9,1.7c3.2,0,5.7-2.6,5.7-6.1c0-3.4-2.6-6.1-5.7-6.1c-1.4,0-2.7,0.5-3.6,1.4V9.7h-2.8V25L36.1,25
		L36.1,25z"/>
	<path class="st18" d="M51.7,15.4c1.7,0,3.2,1.5,3.2,3.4s-1.4,3.4-3.2,3.4c-1.7,0-3.2-1.5-3.2-3.4C48.5,16.9,49.9,15.4,51.7,15.4z
		 M48.6,27.9v-4.6c1.1,1,1.9,1.4,3.4,1.4c3,0,5.5-2.6,5.5-5.9S55.1,13,52,13c-1.5,0-2.7,0.6-3.6,1.7v-1.3h-2.3v14.5H48.6z"/>
	<path class="st18" d="M62.5,22.2c-1.8,0-3.2-1.5-3.2-3.4c0-2,1.4-3.5,3.2-3.5c1.9,0,3.2,1.4,3.2,3.4C65.7,20.8,64.4,22.2,62.5,22.2
		z M65.8,13.4v1.4c-0.8-1-2.3-1.7-3.7-1.7c-3.1,0-5.5,2.5-5.5,5.7c0,3.4,2.3,5.9,5.3,5.9c1.4,0,3-0.7,3.8-1.7v1.4h2.4V13.4H65.8z"/>
	<polygon class="st18" points="72.8,27.9 79.2,13.4 76.1,13.4 73.5,20.3 71,13.4 68.1,13.4 72.1,23.2 70.1,27.9 	"/>
	<ellipse class="st19" cx="95.7" cy="38.5" rx="0.4" ry="0.4"/>
	<ellipse class="st20" cx="66.4" cy="35.6" rx="0.4" ry="0.4"/>
	<path class="st14" d="M77.7,36.6L77.7,36.6c0-0.5-0.1-0.8-0.4-1l0,0l0,0l0,0c-0.3-0.2-0.6-0.3-1-0.3l0,0l0,0l0,0l0,0l0,0l0,0l0,0
		l0,0l0,0l0,0c-0.4,0-0.8,0.1-1,0.3l0,0c-0.3,0.3-0.4,0.6-0.4,1l0,0l0,0v2.2c0,0,0,0.1,0.1,0.1l0.1,0.1h0.4c0,0,0.1,0,0.1-0.1
		l0.1-0.1v-2.1c0-0.3,0.1-0.5,0.2-0.6c0.1-0.1,0.3-0.2,0.6-0.2c0.3,0,0.5,0.1,0.6,0.2c0.1,0.1,0.2,0.4,0.2,0.6v2.1
		c0,0,0,0.1,0.1,0.1l0.1,0.1h0.4c0,0,0.1,0,0.1-0.1l0.1-0.1L77.7,36.6z"/>
	<path class="st14" d="M91.4,36.6L91.4,36.6c0-0.5-0.1-0.8-0.4-1l0,0l0,0c-0.3-0.2-0.6-0.3-1-0.3l0,0l0,0l0,0l0,0l0,0l0,0l0,0l0,0
		l0,0l0,0c-0.4,0-0.8,0.1-1,0.3l0,0l0,0c-0.3,0.3-0.4,0.6-0.4,1l0,0v2.2c0,0,0,0.1,0.1,0.1l0.1,0.1h0.4c0,0,0.1,0,0.1-0.1l0.1-0.1
		v-2.1c0-0.3,0.1-0.5,0.2-0.6s0.3-0.2,0.6-0.2c0.3,0,0.5,0.1,0.6,0.2s0.2,0.4,0.2,0.6v2.1c0,0,0,0.1,0.1,0.1l0.1,0.1h0.4
		c0,0,0.1,0,0.1-0.1l0.1-0.1L91.4,36.6z"/>
	<path class="st14" d="M84.1,37L84.1,37L84.1,37L84.1,37c0,0.4-0.1,0.7-0.2,1c-0.1,0.3-0.3,0.4-0.8,0.4l0,0l0,0
		c-0.4,0-0.6-0.2-0.8-0.4c-0.1-0.3-0.2-0.6-0.2-1l0,0c0-0.3,0.1-0.6,0.2-0.8c0.1-0.3,0.3-0.4,0.8-0.4l0,0l0,0l0,0
		c0.4,0,0.6,0.1,0.8,0.4C84,36.4,84.1,36.7,84.1,37L84.1,37z M84.2,35.6C84.2,35.6,84.2,35.6,84.2,35.6c-0.3-0.2-0.6-0.3-1-0.3l0,0
		c-0.3,0-0.6,0.1-1,0.3v-0.2v-1.1c0,0,0-0.1-0.1-0.1l-0.1-0.1h-0.4c0,0-0.1,0-0.1,0.1l-0.1,0.1v1.1v2.3v1.1c0,0,0,0.1,0.1,0.1h0.1
		h0.4h0.1l0.1-0.1v-0.3c0.3,0.3,0.6,0.4,1,0.4l0,0c0.4,0,0.8-0.1,1-0.3c0.4-0.4,0.5-1,0.5-1.5C84.7,36.5,84.6,36,84.2,35.6z"/>
	<path class="st14" d="M73.7,37.6c0,0.3-0.1,0.5-0.1,0.5c-0.2,0.2-0.5,0.2-0.8,0.2l0,0l0,0c-0.3,0-0.5-0.1-0.6-0.1
		c-0.1-0.1-0.2-0.2-0.2-0.4l0,0c0-0.2,0.1-0.3,0.2-0.4c0.1-0.1,0.3-0.1,0.6-0.1l0,0h1L73.7,37.6L73.7,37.6z M74.4,36.5L74.4,36.5
		c0-0.4-0.1-0.7-0.4-0.9c-0.3-0.2-0.6-0.3-1.1-0.3l0,0l0,0c-0.5,0-0.9,0.1-1.2,0.5l0,0l0,0l-0.1,0.1l0,0v0.1v0.1c0,0,0,0.1,0.1,0.1
		l0,0l0,0l0.1,0.1l0.2,0.1H72c0,0,0.1,0,0.1-0.1l0.1-0.1l0,0c0.1-0.1,0.1-0.1,0.3-0.2c0.1-0.1,0.3-0.1,0.5-0.1l0,0l0,0
		c0.3,0,0.5,0.1,0.6,0.2c0.1,0.1,0.2,0.3,0.2,0.5l0,0v0.3h-1c-0.4,0-0.7,0.1-1,0.3s-0.4,0.5-0.4,0.8l0,0c0,0.3,0.1,0.5,0.3,0.7
		c0.3,0.3,0.6,0.3,1.1,0.3l0,0h0.3c0.5,0,0.8-0.1,1-0.3c0.2-0.3,0.3-0.6,0.3-1v-1H74.4z"/>
	<path class="st14" d="M85.6,37.8L85.6,37.8c0-0.2,0.1-0.3,0.2-0.4c0.1-0.1,0.3-0.1,0.6-0.1l0,0h1v0.3c0,0.3-0.1,0.5-0.1,0.5
		c-0.2,0.2-0.5,0.2-0.8,0.2l0,0l0,0c-0.3,0-0.5-0.1-0.6-0.1C85.6,38.1,85.6,38,85.6,37.8z M87.9,36.5L87.9,36.5
		c0-0.4-0.1-0.7-0.4-0.9c-0.3-0.2-0.6-0.3-1.1-0.3l0,0l0,0c-0.5,0-0.9,0.1-1.2,0.5l0,0l0,0l-0.1,0.1l0,0v0.1v0.1c0,0,0,0.1,0.1,0.1
		l0,0l0,0l0.1,0.1l0.2,0.1h0.1c0,0,0.1,0,0.1-0.1l0.1-0.1c0.1-0.1,0.1-0.1,0.3-0.2c0.1-0.1,0.3-0.1,0.5-0.1l0,0l0,0
		c0.3,0,0.5,0.1,0.6,0.2s0.2,0.3,0.2,0.5l0,0v0.3h-1c-0.4,0-0.7,0.1-1,0.3S85,37.4,85,37.7l0,0c0,0.3,0.1,0.6,0.3,0.7
		c0.3,0.3,0.6,0.3,1.1,0.3l0,0h0.3c0.5,0,0.8-0.1,1-0.3c0.2-0.3,0.3-0.6,0.3-1v-1H87.9z"/>
	<path class="st14" d="M68.4,35.2h-0.6v-0.6v-0.3c0-0.1-0.1-0.1-0.1-0.1h-0.4h-0.1l-0.1,0.1v0.6v3.1c0,0.3,0.1,0.5,0.3,0.6
		c0.1,0.2,0.4,0.3,0.7,0.3l0,0h0.2l0,0h0.2c0,0,0.1,0,0.1-0.1v-0.1v-0.4v-0.1l-0.1-0.1h-0.3c-0.1,0-0.1,0-0.1,0h-0.1
		c0,0,0,0-0.1-0.1s-0.1-0.1-0.1-0.3v-1.9h0.6c0,0,0.1,0,0.1-0.1v-0.1v-0.4v-0.1C68.5,35.2,68.4,35.2,68.4,35.2z"/>
	<path class="st14" d="M71.2,35.7L71.2,35.7C71.2,35.6,71.2,35.6,71.2,35.7L71.2,35.7L71.2,35.7L71.2,35.7L71.2,35.7L71.2,35.7
		c-0.3-0.3-0.6-0.4-0.8-0.4l0,0c-0.2,0-0.5,0.1-0.6,0.3l-0.1,0.1v-0.1v-0.2c0,0,0-0.1-0.1-0.1l-0.1-0.1h-0.4c0,0-0.1,0-0.1,0.1
		L69,35.4v0.2v3.2c0,0,0,0.1,0.1,0.1h0.1h0.1l0,0h0.3l0,0h0.1h0.1l0.1-0.1v-0.1l0,0v-2.1l0,0v-0.2c0-0.2,0.1-0.4,0.2-0.5
		c0.1-0.1,0.3-0.2,0.5-0.2c0.1,0,0.2,0,0.3,0.1c0.1,0,0.1,0.1,0.2,0.1l0,0l0.1,0.1l0.1,0.1c0,0,0.1,0,0.1-0.1l0.3-0.3V35.7
		C71.2,35.7,71.2,35.7,71.2,35.7z"/>
	<path class="st14" d="M80.8,37C80.8,37,80.8,37,80.8,37L80.8,37c-0.3-0.1-0.5-0.2-0.8-0.3l-0.6-0.1c-0.3,0-0.4-0.1-0.5-0.1
		c-0.1-0.1-0.1-0.1-0.1-0.3l0,0l0,0c0-0.2,0.1-0.3,0.2-0.4c0.1-0.1,0.3-0.1,0.6-0.1l0,0c0.3,0,0.6,0.1,0.8,0.3l0,0l0.1,0.1h0.1
		c0,0,0.1,0,0.1-0.1l0.2-0.3v-0.1c0,0,0,0,0-0.1c0,0,0,0-0.1-0.1l0,0c-0.3-0.3-0.8-0.4-1.4-0.4c-0.4,0-0.8,0.1-1,0.3
		c-0.3,0.2-0.4,0.5-0.4,0.8l0,0l0,0l0,0c0,0.3,0.1,0.5,0.3,0.7c0.2,0.2,0.5,0.3,0.9,0.3l0.6,0.1c0.2,0,0.3,0.1,0.5,0.1
		c0.1,0.1,0.1,0.1,0.1,0.3l0,0l0,0c0,0.2-0.1,0.3-0.2,0.4c-0.1,0.1-0.4,0.1-0.7,0.1l0,0l0,0l0,0c-0.5,0-0.7-0.1-1-0.3l-0.1-0.1h-0.1
		c0,0-0.1,0-0.1,0.1l-0.3,0.3v0.1c0,0,0,0.1,0.1,0.1l0.1,0.1l0,0l0,0l0,0c0.4,0.3,0.8,0.4,1.4,0.4l0,0c0.5,0,0.8-0.1,1.1-0.3
		c0.3-0.2,0.5-0.5,0.5-0.8l0,0C81.2,37.4,81.1,37.2,80.8,37z"/>
	<path class="st14" d="M95,38.7l-0.5-0.6l-1-1.4l0.8-0.8l0.5-0.5l0,0c0.1-0.1,0-0.1,0-0.1l-0.1-0.1h-0.5c0,0-0.1,0-0.1,0.1l0,0
		l-1.7,1.8v-1.5v-1.3c0,0,0-0.1-0.1-0.1h-0.1h-0.5h-0.1l-0.1,0.1v1.3v3.2c0,0,0,0.1,0.1,0.1h0.1h0.4h0.1l0.1-0.1v-0.9l0.7-0.8
		l0.5,0.7l0,0l0.7,1c0,0,0.1,0.1,0.1,0.1H95c0,0,0.1,0,0.1-0.1C95,38.8,95,38.8,95,38.7z"/>
	<path class="st14" d="M90.7,34.2L90.7,34.2l0.2,0.3l0.1-0.3H91v0.3H91v-0.2c0,0,0,0,0-0.1v-0.1l-0.1,0.3h-0.1L90.7,34.2L90.7,34.2
		l0.1,0.1c0,0,0,0,0,0.1v0.2h-0.1V34.2z"/>
	<path class="st14" d="M91.4,34.3C91.4,34.3,91.4,34.3,91.4,34.3C91.4,34.3,91.4,34.3,91.4,34.3l0.1-0.1c0,0,0,0-0.1,0h-0.1v0.1
		C91.2,34.3,91.4,34.3,91.4,34.3z M91.2,34.2h0.1h0.1c0.1,0,0.1,0.1,0.1,0.1v0.1c0,0,0,0-0.1,0.1c0,0,0,0,0.1,0c0,0,0,0,0,0.1v0.1
		l0,0l0,0l0,0h-0.1l0,0l0,0v-0.1v-0.1c0,0,0,0-0.1,0h-0.1v0.1l0,0V34.2z"/>
	<ellipse class="st14" cx="91.1" cy="34.5" rx="0" ry="0"/>
	<path class="st14" d="M91.6,34.5C91.6,34.5,91.6,34.5,91.6,34.5C91.6,34.5,91.6,34.5,91.6,34.5C91.6,34.5,91.6,34.5,91.6,34.5
		L91.6,34.5L91.6,34.5z"/>
</g>
</svg>
