{
	"info": {
		"_postman_id": "b4132948-bc4e-4147-b25a-96f9acc8f36d",
		"name": "10_instantiate_service_vnf_vfmodule",
		"schema": "https://schema.getpostman.com/json/collection/v2.1.0/collection.json"
	},
	"item": [
		{
			"name": "GET ExternalAPI-NBI component Status (HealthCheck)",
			"event": [
				{
					"listen": "test",
					"script": {
						"id": "ddeb2e4b-2ef6-4b58-8e5c-cc202fbb232a",
						"exec": [
							"pm.test(\"Status code is 200\", function () {",
							"    pm.response.to.have.status(200);",
							"});",
							"var NBI_status = false;",
							"var jsonData = pm.response.json();",
							"",
							"if (jsonData.status === \"ok\") {",
							"       NBI_status = true;",
							"}",
							"tests[\"NBI status OK\"] = NBI_status === true;",
							""
						],
						"type": "text/javascript"
					}
				}
			],
			"request": {
				"method": "GET",
				"header": [],
				"body": {
					"mode": "raw",
					"raw": ""
				},
				"url": {
					"raw": "{{url-nbi}}/nbi/api/v3/status",
					"host": [
						"{{url-nbi}}"
					],
					"path": [
						"nbi",
						"api",
						"v3",
						"status"
					]
				}
			},
			"response": []
		},
		{
			"name": "GET all service models from Service Catalog API",
			"event": [
				{
					"listen": "test",
					"script": {
						"id": "d020751d-1ca5-4c47-af33-40faea633e62",
						"exec": [
							"pm.test(\"Status code is 200\", function () {",
							"    pm.response.to.have.status(200);",
							"});",
							"var jsonData = pm.response.json();",
							"var service_found = false;",
							"for (var i = 0; i < jsonData.length; i++) { ",
							"   if (jsonData[i].name === pm.globals.get(\"service\")) {",
							"       service_found = true;",
							"       pm.globals.set(\"auto_service_id\", \"\"+jsonData[i].id+\"\");",
							"   }",
							"}",
							"tests[\"Service : \"+pm.globals.get(\"service\")+\" exists\"] = service_found === true;",
							""
						],
						"type": "text/javascript"
					}
				}
			],
			"request": {
				"method": "GET",
				"header": [],
				"body": {
					"mode": "raw",
					"raw": ""
				},
				"url": {
					"raw": "{{url-nbi}}/nbi/api/v3/serviceSpecification",
					"host": [
						"{{url-nbi}}"
					],
					"path": [
						"nbi",
						"api",
						"v3",
						"serviceSpecification"
					]
				}
			},
			"response": []
		},
		{
			"name": "GET all service instances via ServiceInventory API",
			"event": [
				{
					"listen": "test",
					"script": {
						"id": "79e173a3-297e-467f-8c9b-be90035a91aa",
						"exec": [
							"pm.test(\"Status code is 200\", function () {",
							"    pm.response.to.have.status(200);",
							"});",
							"var jsonData = pm.response.json();",
							"var service_instance_found = false;",
							"for (var i = 0; i < jsonData.length; i++) { ",
							"   if (jsonData[i].name === pm.globals.get(\"service_instance_name\")) {",
							"       service_instance_found = true;",
							"   }",
							"}",
							"tests[\"Service instance : \"+pm.globals.get(\"service_instance_name\")+\" does not exist\"] = service_instance_found === false;"
						],
						"type": "text/javascript"
					}
				}
			],
			"request": {
				"method": "GET",
				"header": [],
				"body": {
					"mode": "raw",
					"raw": ""
				},
				"url": {
					"raw": "{{url-nbi}}/nbi/api/v3/service?relatedParty.id={{customer_name}}",
					"host": [
						"{{url-nbi}}"
					],
					"path": [
						"nbi",
						"api",
						"v3",
						"service"
					],
					"query": [
						{
							"key": "relatedParty.id",
							"value": "{{customer_name}}"
						}
					]
				}
			},
			"response": []
		},
		{
			"name": "Add service instance via ServiceOrder API",
			"event": [
				{
					"listen": "test",
					"script": {
						"id": "9e3790c5-456a-44aa-9579-de3e9be2b61a",
						"exec": [
							"pm.test(\"Status code is 201\", function () {",
							"    pm.response.to.have.status(201);",
							"});",
							"",
							"var jsonData = pm.response.json();",
							"tests[pm.globals.get(\"externalId\")+\" exists\"] = jsonData.externalId === pm.globals.get(\"externalId\");",
							"",
							"pm.globals.set(\"auto_service_order_id\", jsonData.id);",
							"    "
						],
						"type": "text/javascript"
					}
				}
			],
			"request": {
				"method": "POST",
				"header": [
					{
						"key": "Accept",
						"value": "application/json"
					},
					{
						"key": "Content-Type",
						"value": "application/json"
					}
				],
				"body": {
					"mode": "raw",
					"raw": "{\n  \"externalId\": \"{{externalId}}\",\n  \"priority\": \"1\",\n  \"description\": \"{{service}} order for generic customer via Postman\",\n  \"category\": \"Consumer\",\n  \"requestedStartDate\": \"2018-04-26T08:33:37.299Z\",\n  \"requestedCompletionDate\": \"2018-04-26T08:33:37.299Z\",\n  \"relatedParty\": [\n    {\n      \"id\": \"{{customer_name}}\",\n      \"role\": \"ONAPcustomer\",\n      \"name\": \"{{customer_name}}\"\n    }\n  ],\n  \"orderItem\": [\n    {\n      \"id\": \"1\",\n      \"action\": \"add\",\n      \"service\": {\n        \"name\": \"{{service_instance_name}}\",\n        \"serviceState\": \"active\",\n        \"serviceSpecification\": {\n          \"id\": \"{{auto_service_id}}\"\n        }\n      }\n    }\n  ]\n}"
				},
				"url": {
					"raw": "{{url-nbi}}/nbi/api/v3/serviceOrder",
					"host": [
						"{{url-nbi}}"
					],
					"path": [
						"nbi",
						"api",
						"v3",
						"serviceOrder"
					]
				}
			},
			"response": []
		},
		{
			"name": "GET previous serviceOrder after 10s",
			"event": [
				{
					"listen": "test",
					"script": {
						"id": "dc4fc1f9-cd6a-41c8-a972-06694d869384",
						"exec": [
							"pm.test(\"Status code is 200\", function () {",
							"    pm.response.to.have.status(200);",
							"});",
							"",
							"var jsonData = pm.response.json();",
							"",
							"tests[pm.globals.get(\"externalId\")+\" exists\"] = jsonData.externalId === pm.globals.get(\"externalId\");",
							"tests[\"service_order_id exists\"] = jsonData.id === pm.globals.get(\"auto_service_order_id\");",
							"tests[\"service Order state is : \"+jsonData.state] = jsonData.state === \"completed\";",
							"tests[\"Service Instance state is : \"+jsonData.orderItem[0].service.serviceState] = jsonData.orderItem[0].service.serviceState === \"active\";",
							"",
							"",
							"if(jsonData.state == \"completed\"){",
							"    pm.globals.set(\"auto_service_instance_id\", \"\"+jsonData.orderItem[0].service.id+\"\");",
							"}",
							"if (jsonData.orderMessage !== null){",
							"    tests[\"order message is : \" +jsonData.orderMessage[0].messageInformation] = jsonData.orderMessage[0].messageInformation === \"\";",
							"    pm.globals.set(\"auto_service_messageInformation\", \"\"+jsonData.orderMessage[0].messageInformation+\"\");",
							"    }",
							""
						],
						"type": "text/javascript"
					}
				},
				{
					"listen": "prerequest",
					"script": {
						"id": "b2473649-e045-465e-84cc-0725d83d57ed",
						"exec": [
							"  var date = new Date();",
							"  var curDate = null;",
							"  do {",
							"    curDate = new Date();",
							"  }",
							"  while (curDate - date < 10000);"
						],
						"type": "text/javascript"
					}
				}
			],
			"request": {
				"method": "GET",
				"header": [
					{
						"key": "Accept",
						"value": "application/json"
					},
					{
						"key": "Content-Type",
						"value": "application/json"
					}
				],
				"body": {
					"mode": "raw",
					"raw": ""
				},
				"url": {
					"raw": "{{url-nbi}}/nbi/api/v3/serviceOrder/{{auto_service_order_id}}",
					"host": [
						"{{url-nbi}}"
					],
					"path": [
						"nbi",
						"api",
						"v3",
						"serviceOrder",
						"{{auto_service_order_id}}"
					]
				}
			},
			"response": []
		},
		{
			"name": "SO orchestrationRequests",
			"event": [
				{
					"listen": "test",
					"script": {
						"id": "1536607a-13f7-4c9a-97a6-af7f5dbc0593",
						"exec": [
							"pm.test(\"Status code is 200\", function () {",
							"    pm.response.to.have.status(200);",
							"});",
							"var jsonData = pm.response.json();",
							"",
							"if (jsonData.requestList.length > 0){",
							"    tests[\"requestState is : \"+jsonData.requestList[0].request.requestStatus.requestState] = jsonData.requestList[0].request.requestStatus.requestState === \"COMPLETE\";",
							"    tests[\"statusMessage is : \"+jsonData.requestList[0].request.requestStatus.statusMessage] = jsonData.requestList[0].request.requestStatus.statusMessage === \"Service Instance was created successfully.\";",
							"}",
							"else {",
							"    tests[\"no order for that service instance\"] = true === false;",
							"}"
						],
						"type": "text/javascript"
					}
				}
			],
			"request": {
				"method": "GET",
				"header": [
					{
						"key": "Accept",
						"value": "application/json"
					},
					{
						"key": "Content-Type",
						"value": "application/json"
					},
					{
						"key": "X-FromAppId",
						"value": "AAI"
					},
					{
						"key": "X-TransactionId",
						"value": "get_aai_subscr"
					},
					{
						"key": "Authorization",
						"value": "Basic SW5mcmFQb3J0YWxDbGllbnQ6cGFzc3dvcmQxJA=="
					}
				],
				"body": {
					"mode": "raw",
					"raw": ""
				},
				"url": {
					"raw": "{{url-so}}/onap/so/infra/orchestrationRequests/v6?filter=serviceInstanceName:EQUALS:{{service_instance_name}}",
					"host": [
						"{{url-so}}"
					],
					"path": [
						"onap",
						"so",
						"infra",
						"orchestrationRequests",
						"v6"
					],
					"query": [
						{
							"key": "filter",
							"value": "serviceInstanceName:EQUALS:{{service_instance_name}}"
						}
					]
				}
			},
			"response": []
		},
		{
			"name": "Check service instance in inventory via NBI request",
			"event": [
				{
					"listen": "test",
					"script": {
						"id": "f1cbf2f1-1ed2-4d21-9483-46602241705d",
						"exec": [
							"tests[\"Service Instance : \"+ pm.globals.get(\"service_instance_name\") +\" exists in AAI inventory\"] = pm.response.code === 200;",
							""
						],
						"type": "text/javascript"
					}
				}
			],
			"request": {
				"method": "GET",
				"header": [],
				"body": {
					"mode": "raw",
					"raw": ""
				},
				"url": {
					"raw": "{{url-nbi}}/nbi/api/v3/service/{{auto_service_instance_id}}?relatedParty.id={{customer_name}}&serviceSpecification.name={{service}}",
					"host": [
						"{{url-nbi}}"
					],
					"path": [
						"nbi",
						"api",
						"v3",
						"service",
						"{{auto_service_instance_id}}"
					],
					"query": [
						{
							"key": "relatedParty.id",
							"value": "{{customer_name}}"
						},
						{
							"key": "serviceSpecification.name",
							"value": "{{service}}"
						}
					]
				}
			},
			"response": []
		},
		{
			"name": "Instantiate vnf",
			"event": [
				{
					"listen": "test",
					"script": {
						"id": "e779f618-dd36-474f-802d-a36abdf69708",
						"exec": [
							"pm.test(\"Status code is 202\", function () {",
							"    pm.response.to.have.status(202);",
							"});",
							"",
							"var jsonData = pm.response.json();",
							"",
							"pm.globals.set(\"auto_so_request_id\", \"\"+jsonData.requestReferences.requestId+\"\");",
							"pm.globals.set(\"auto_vnf_instance_id\", \"\"+jsonData.requestReferences.instanceId+\"\");",
							""
						],
						"type": "text/javascript"
					}
				}
			],
			"request": {
				"method": "POST",
				"header": [
					{
						"key": "Accept",
						"value": "application/json"
					},
					{
						"key": "Content-Type",
						"value": "application/json"
					},
					{
						"key": "X-FromAppId",
						"value": "AAI"
					},
					{
						"key": "X-TransactionId",
						"value": "get_aai_subscr"
					},
					{
						"key": "Authorization",
						"value": "Basic SW5mcmFQb3J0YWxDbGllbnQ6cGFzc3dvcmQxJA=="
					}
				],
				"body": {
					"mode": "raw",
					"raw": "{\n  \"requestDetails\": {\n    \"requestInfo\": {\n      \"productFamilyId\": \"{{auto_service_uuid}}\",\n      \"instanceName\": \"{{vnf_instance_name}}\",\n      \"source\": \"VID\",\n      \"suppressRollback\": false,\n      \"requestorId\": \"test\"\n    },\n\t\"modelInfo\": {\n\t\t\"modelType\": \"vnf\",\n\t\t\"modelInvariantId\": \"{{auto_vf_invariant_uuid}}\",\n\t\t\t\"modelVersionId\": \"{{auto_vf_uuid}}\",\n\t\t\t\"modelName\": \"{{vf_name}}\",\n\t\t\t\"modelVersion\": \"1.0\",\n\t\t\t\"modelCustomizationId\": \"{{auto_vf_customization_uuid}}\",\n\t\t\t\"modelCustomizationName\": \"{{auto_vf_name_for_model}}\"\n\t\t},\n    \"requestParameters\": {\n      \"userParams\": [],\n      \"aLaCarte\": true,\n\t  \"testApi\": \"VNF_API\"\n    },\n    \"cloudConfiguration\": {\n      \"lcpCloudRegionId\": \"{{onap_cloud_region_id}}\",\n      \"tenantId\": \"{{tenant_id}}\"\n    },\n\t\t\"lineOfBusiness\": {\n\t\t\t\"lineOfBusinessName\": \"{{lineofbusiness}}\"\n\t\t},\n\t\t\"platform\": {\n\t\t\t\"platformName\": \"{{platform}}\"\n\t\t},\n\t\t\"relatedInstanceList\": [{\n\t\t\t\"relatedInstance\": {\n\t\t\t\t\"instanceId\": \"{{auto_service_instance_id}}\",\n\t\t\t\t\"modelInfo\": {\n\t\t\t\t\t\"modelType\": \"service\",\n\t\t\t\t\t\"modelName\": \"{{service}}\",\n\t\t\t\t\t\"modelInvariantId\": \"{{auto_service_invariant_uuid}}\",\n\t\t\t\t\t\"modelVersion\": \"1.0\",\n\t\t\t\t\t\"modelVersionId\": \"{{auto_service_uuid}}\"\n\t\t\t\t}\n\t\t\t}\n\t\t}]\n  }\n}\n\n"
				},
				"url": {
					"raw": "{{url-so}}/onap/so/infra/serviceInstances/v6/{{auto_service_instance_id}}/vnfs",
					"host": [
						"{{url-so}}"
					],
					"path": [
						"onap",
						"so",
						"infra",
						"serviceInstances",
						"v6",
						"{{auto_service_instance_id}}",
						"vnfs"
					]
				}
			},
			"response": []
		},
		{
			"name": "SO orchestrationRequests after 10s",
			"event": [
				{
					"listen": "test",
					"script": {
						"id": "750de5df-76ee-42c6-8f04-bfb9e1a9ea33",
						"exec": [
							"pm.test(\"Status code is 200\", function () {",
							"    pm.response.to.have.status(200);",
							"});",
							"var jsonData = pm.response.json();",
							"",
							"pm.globals.set(\"auto_vnf_instance_id\", \"\"+jsonData.request.instanceReferences.vnfInstanceId+\"\");",
							"tests[\"requestState is : \"+jsonData.request.requestStatus.requestState] = jsonData.request.requestStatus.requestState === \"COMPLETE\";",
							"tests[\"statusMessage is : \"+jsonData.request.requestStatus.statusMessage] = jsonData.request.requestStatus.statusMessage === \"Vnf has been created successfully.\";",
							""
						],
						"type": "text/javascript"
					}
				},
				{
					"listen": "prerequest",
					"script": {
						"id": "15a5b018-1d8a-4326-9810-cf94a1f4d80f",
						"exec": [
							"  var date = new Date();",
							"  var curDate = null;",
							"  do {",
							"    curDate = new Date();",
							"  }",
							"  while (curDate - date < 10000);"
						],
						"type": "text/javascript"
					}
				}
			],
			"request": {
				"method": "GET",
				"header": [
					{
						"key": "Accept",
						"value": "application/json"
					},
					{
						"key": "Content-Type",
						"value": "application/json"
					},
					{
						"key": "X-FromAppId",
						"value": "AAI"
					},
					{
						"key": "X-TransactionId",
						"value": "get_aai_subscr"
					},
					{
						"key": "Authorization",
						"value": "Basic SW5mcmFQb3J0YWxDbGllbnQ6cGFzc3dvcmQxJA=="
					}
				],
				"body": {
					"mode": "raw",
					"raw": ""
				},
				"url": {
					"raw": "{{url-so}}/onap/so/infra/orchestrationRequests/v6/{{auto_so_request_id}}",
					"host": [
						"{{url-so}}"
					],
					"path": [
						"onap",
						"so",
						"infra",
						"orchestrationRequests",
						"v6",
						"{{auto_so_request_id}}"
					]
				}
			},
			"response": []
		},
		{
			"name": "check vnf instance in inventory via AAI request",
			"event": [
				{
					"listen": "test",
					"script": {
						"id": "a08edc1f-6b8c-4a7e-91ce-6d774d0dfb1e",
						"exec": [
							"pm.test(\"Status code is 200\", function () {",
							"    pm.response.to.have.status(200);",
							"});",
							"var jsonData = pm.response.json();",
							"var vnf_instance_found = false;",
							"for (var i = 0; i < jsonData[\"generic-vnf\"].length; i++) { ",
							"   if (jsonData[\"generic-vnf\"][i][\"vnf-name\"] === pm.globals.get(\"vnf_instance_name\")) {",
							"       vnf_instance_found = true;",
							"   }",
							"}",
							"tests[\"VNF Instance : \"+ pm.globals.get(\"vnf_instance_name\") +\" exists in AAI inventory\"] = vnf_instance_found === true;"
						],
						"type": "text/javascript"
					}
				}
			],
			"request": {
				"method": "GET",
				"header": [
					{
						"key": "Authorization",
						"value": "Basic QUFJOkFBSQ=="
					},
					{
						"key": "X-FromAppId",
						"value": "AAI"
					},
					{
						"key": "Accept",
						"value": "application/json"
					},
					{
						"key": "X-TransactionId",
						"value": "get_aai_subscr"
					},
					{
						"key": "Content-Type",
						"value": "application/json"
					}
				],
				"body": {
					"mode": "raw",
					"raw": ""
				},
				"url": {
					"raw": "{{url-aai}}/aai/v14/network/generic-vnfs",
					"host": [
						"{{url-aai}}"
					],
					"path": [
						"aai",
						"v14",
						"network",
						"generic-vnfs"
					]
				}
			},
			"response": []
		},
		{
			"name": "preload for VFmodule",
			"event": [
				{
					"listen": "test",
					"script": {
						"id": "62a8ef7f-7fde-423c-8b70-5f74bb6bc00b",
						"exec": [
							"pm.test(\"Status code is 200\", function () {",
							"    pm.response.to.have.status(200);",
							"});"
						],
						"type": "text/javascript"
					}
				}
			],
			"request": {
				"method": "POST",
				"header": [
					{
						"key": "Accept",
						"value": "application/json"
					},
					{
						"key": "Content-Type",
						"value": "application/json"
					},
					{
						"key": "X-TransactionId",
						"value": "0a3f6713-ba96-4971-a6f8-c2da85a3176e"
					},
					{
						"key": "X-FromAppId",
						"value": "API client"
					},
					{
						"key": "Authorization",
						"value": "Basic YWRtaW46S3A4Yko0U1hzek0wV1hsaGFrM2VIbGNzZTJnQXc4NHZhb0dHbUp2VXkyVQ=="
					}
				],
				"body": {
					"mode": "raw",
					"raw": "{\n    \"input\": {\n        \"request-information\": {\n            \"notification-url\": \"onap.org\",\n            \"order-number\": \"1\",\n            \"order-version\": \"1\",\n            \"request-action\": \"PreloadVNFRequest\",\n            \"request-id\": \"test\"\n        },\n        \"sdnc-request-header\": {\n            \"svc-action\": \"reserve\",\n            \"svc-notification-url\": \"http:\\/\\/onap.org:8080\\/adapters\\/rest\\/SDNCNotify\",\n            \"svc-request-id\": \"test\"\n        },\n        \"vnf-topology-information\": {\n            \"vnf-assignments\": {\n                \"availability-zones\": [],\n                \"vnf-networks\": [],\n                \"vnf-vms\": []\n            },\n                        \"vnf-parameters\": [],\n            \"vnf-topology-identifier\": {\n                \"generic-vnf-name\": \"{{vnf_instance_name}}\",\n                \"generic-vnf-type\": \"{{auto_vf_name_for_model}}\",\n                \"service-type\": \"{{auto_service_instance_id}}\",\n                \"vnf-name\": \"{{vfmodule_instance_name}}\",\n                \"vnf-type\": \"{{auto_vf_module_model_name}}\"\n            }\n        }\n    }\n}\n\n"
				},
				"url": {
					"raw": "{{url-sdnc}}/restconf/operations/VNF-API:preload-vnf-topology-operation",
					"host": [
						"{{url-sdnc}}"
					],
					"path": [
						"restconf",
						"operations",
						"VNF-API:preload-vnf-topology-operation"
					]
				}
			},
			"response": []
		},
		{
			"name": "Instantiate vf-module",
			"event": [
				{
					"listen": "test",
					"script": {
						"id": "61781baf-f6d4-4229-95d0-32e85cde3e82",
						"exec": [
							"pm.test(\"Status code is 202\", function () {",
							"    pm.response.to.have.status(202);",
							"});",
							"",
							"var jsonData = pm.response.json();",
							"if (responseCode.code === 202){",
							"    pm.globals.set(\"auto_so_request_id\", \"\"+jsonData.requestReferences.requestId+\"\");",
							"    pm.globals.set(\"auto_vfmodule_instance_id\", \"\"+jsonData.requestReferences.instanceId+\"\");",
							"}"
						],
						"type": "text/javascript"
					}
				}
			],
			"request": {
				"method": "POST",
				"header": [
					{
						"key": "Accept",
						"value": "application/json"
					},
					{
						"key": "Content-Type",
						"value": "application/json"
					},
					{
						"key": "X-FromAppId",
						"value": "AAI"
					},
					{
						"key": "X-TransactionId",
						"value": "get_aai_subscr"
					},
					{
						"key": "Authorization",
						"value": "Basic SW5mcmFQb3J0YWxDbGllbnQ6cGFzc3dvcmQxJA=="
					}
				],
				"body": {
					"mode": "raw",
					"raw": "{\n  \"requestDetails\": {\n    \"requestInfo\": {\n      \"instanceName\": \"{{vfmodule_instance_name}}\",\n      \"source\": \"VID\",\n      \"suppressRollback\": false,\n      \"requestorId\": \"test\"\n    },\n\t\"modelInfo\": {\n\t\t\"modelType\": \"vfModule\",\n\t\t\"modelInvariantId\": \"{{auto_vf_module_model_invariant_uuid}}\",\n\t\t\"modelVersionId\": \"{{auto_vf_module_model_uuid}}\",\n\t\t\"modelName\": \"{{auto_vf_module_model_name}}\",\n\t\t\"modelVersion\": \"1\",\n\t\t\"modelCustomizationId\": \"{{auto_vf_module_model_customization_uuid}}\",\n\t\t\"modelCustomizationName\": \"{{auto_vf_module_model_name}}\"\n\t},\n \t\"requestParameters\": {\n \t\t\"userParams\": [],\n \t\t\"testApi\": \"VNF_API\",\n \t\t\"usePreload\": true\n \t},\n    \"cloudConfiguration\": {\n      \"lcpCloudRegionId\": \"{{onap_cloud_region_id}}\",\n      \"tenantId\": \"{{tenant_id}}\"\n    },\n\t\t\"relatedInstanceList\": [{\n\t\t\t\"relatedInstance\": {\n\t\t\t\t\"instanceId\": \"{{auto_service_instance_id}}\",\n\t\t\t\t\"modelInfo\": {\n\t\t\t\t\t\"modelType\": \"service\",\n\t\t\t\t\t\"modelName\": \"{{service}}\",\n\t\t\t\t\t\"modelInvariantId\": \"{{auto_service_invariant_uuid}}\",\n\t\t\t\t\t\"modelVersion\": \"1.0\",\n\t\t\t\t\t\"modelVersionId\": \"{{auto_service_uuid}}\"\n\t\t\t\t}\n\t\t\t}\n\t\t},\n\t\t{\n\t\t\t\"relatedInstance\": {\n\t\t\t\t\"instanceId\": \"{{auto_vnf_instance_id}}\",\n\t\t\t\t\"modelInfo\": {\n\t\t\t\t\t\"modelType\": \"vnf\",\n\t\t\t\t\t\"modelName\": \"{{vf_name}}\",\n\t\t\t\t\t\"modelInvariantId\": \"{{auto_vf_invariant_uuid}}\",\n\t\t\t\t\t\"modelVersion\": \"1.0\",\n\t\t\t\t\t\"modelVersionId\": \"{{auto_vf_uuid}}\",\n\t\t\t\t\t\"modelCustomizationId\": \"{{auto_vf_customization_uuid}}\",\n\t\t\t\t\t\"modelCustomizationName\": \"{{auto_vf_name_for_model}}\"\n\t\t\t\t}\n\t\t\t}\n\t\t}]\n  }\n}\n\n"
				},
				"url": {
					"raw": "{{url-so}}/onap/so/infra/serviceInstances/v6/{{auto_service_instance_id}}/vnfs/{{auto_vnf_instance_id}}/vfModules",
					"host": [
						"{{url-so}}"
					],
					"path": [
						"onap",
						"so",
						"infra",
						"serviceInstances",
						"v6",
						"{{auto_service_instance_id}}",
						"vnfs",
						"{{auto_vnf_instance_id}}",
						"vfModules"
					]
				}
			},
			"response": []
		},
		{
			"name": "SO orchestrationRequests after 120s",
			"event": [
				{
					"listen": "test",
					"script": {
						"id": "ef3be415-7453-4d2d-91ce-de6e2df05dbe",
						"exec": [
							"pm.test(\"Status code is 200\", function () {",
							"    pm.response.to.have.status(200);",
							"});",
							"var jsonData = pm.response.json();",
							"",
							"pm.globals.set(\"auto_vfmodule_instance_id\", \"\"+jsonData.request.instanceReferences.vfModuleInstanceId+\"\");",
							"tests[\"requestState is : \"+jsonData.request.requestStatus.requestState] = jsonData.request.requestStatus.requestState === \"COMPLETE\";",
							"tests[\"statusMessage is : \"+jsonData.request.requestStatus.statusMessage] = jsonData.request.requestStatus.statusMessage === \"Vf Module has been created successfully.\";"
						],
						"type": "text/javascript"
					}
				},
				{
					"listen": "prerequest",
					"script": {
						"id": "8f7cbf38-cb21-45af-9648-1915c92bcb12",
						"exec": [
							"  var date = new Date();",
							"  var curDate = null;",
							"  do {",
							"    curDate = new Date();",
							"  }",
							"  while (curDate - date < 120000);"
						],
						"type": "text/javascript"
					}
				}
			],
			"request": {
				"method": "GET",
				"header": [
					{
						"key": "Accept",
						"value": "application/json"
					},
					{
						"key": "Content-Type",
						"value": "application/json"
					},
					{
						"key": "X-FromAppId",
						"value": "AAI"
					},
					{
						"key": "X-TransactionId",
						"value": "get_aai_subscr"
					},
					{
						"key": "Authorization",
						"value": "Basic SW5mcmFQb3J0YWxDbGllbnQ6cGFzc3dvcmQxJA=="
					}
				],
				"body": {
					"mode": "raw",
					"raw": ""
				},
				"url": {
					"raw": "{{url-so}}/onap/so/infra/orchestrationRequests/v6/{{auto_so_request_id}}",
					"host": [
						"{{url-so}}"
					],
					"path": [
						"onap",
						"so",
						"infra",
						"orchestrationRequests",
						"v6",
						"{{auto_so_request_id}}"
					]
				}
			},
			"response": []
		},
		{
			"name": "check vfmodule instance in inventory via AAI request",
			"event": [
				{
					"listen": "test",
					"script": {
						"id": "81203009-3d68-426d-9491-1276983693e5",
						"exec": [
							"pm.test(\"Status code is 200\", function () {",
							"    pm.response.to.have.status(200);",
							"});",
							"var jsonData = pm.response.json();",
							"var vfmodule_instance_found = false;",
							"for (var i = 0; i < jsonData[\"vf-module\"].length; i++) { ",
							"   if (jsonData[\"vf-module\"][i][\"vf-module-name\"] === pm.globals.get(\"vfmodule_instance_name\")) {",
							"       vfmodule_instance_found = true;",
							"   }",
							"}",
							"tests[\"vfmodule Instance : \"+ pm.globals.get(\"vfmodule_instance_name\") +\" exists in AAI inventory\"] = vfmodule_instance_found === true;"
						],
						"type": "text/javascript"
					}
				}
			],
			"request": {
				"method": "GET",
				"header": [
					{
						"key": "Authorization",
						"value": "Basic QUFJOkFBSQ=="
					},
					{
						"key": "X-FromAppId",
						"value": "AAI"
					},
					{
						"key": "Accept",
						"value": "application/json"
					},
					{
						"key": "X-TransactionId",
						"value": "get_aai_subscr"
					},
					{
						"key": "Content-Type",
						"value": "application/json"
					}
				],
				"body": {
					"mode": "raw",
					"raw": ""
				},
				"url": {
					"raw": "{{url-aai}}/aai/v13/network/generic-vnfs/generic-vnf/{{auto_vnf_instance_id}}/vf-modules",
					"host": [
						"{{url-aai}}"
					],
					"path": [
						"aai",
						"v13",
						"network",
						"generic-vnfs",
						"generic-vnf",
						"{{auto_vnf_instance_id}}",
						"vf-modules"
					]
				}
			},
			"response": []
		},
		{
			"name": "preload for Virtual Link",
			"event": [
				{
					"listen": "test",
					"script": {
						"id": "62a8ef7f-7fde-423c-8b70-5f74bb6bc00b",
						"exec": [
							"pm.test(\"Status code is 200\", function () {",
							"    pm.response.to.have.status(200);",
							"});"
						],
						"type": "text/javascript"
					}
				}
			],
			"request": {
				"method": "POST",
				"header": [
					{
						"key": "Accept",
						"value": "application/json"
					},
					{
						"key": "Content-Type",
						"value": "application/json"
					},
					{
						"key": "X-TransactionId",
						"value": "0a3f6713-ba96-4971-a6f8-c2da85a3176e"
					},
					{
						"key": "X-FromAppId",
						"value": "API client"
					},
					{
						"key": "Authorization",
						"value": "Basic YWRtaW46S3A4Yko0U1hzek0wV1hsaGFrM2VIbGNzZTJnQXc4NHZhb0dHbUp2VXkyVQ=="
					}
				],
				"body": {
					"mode": "raw",
					"raw": "{\n  \"VNF-API:input\": {\n    \"VNF-API:request-information\": {\n      \"VNF-API:request-id\": \"postman001\",\n      \"VNF-API:notification-url\": \"http://so.onap.org\",\n      \"VNF-API:order-number\": \"postman001\",\n      \"VNF-API:request-sub-action\": \"SUPP\",\n      \"VNF-API:request-action\": \"PreloadNetworkRequest\",\n      \"VNF-API:source\": \"postman\",\n      \"VNF-API:order-version\": \"1.0\"\n    },\n    \"VNF-API:network-topology-information\": {\n      \"VNF-API:network-topology-identifier\": {\n        \"VNF-API:network-role\": \"integration_test_net\",\n        \"VNF-API:network-technology\": \"neutron\",\n        \"VNF-API:service-type\": \"{{service}}\",\n        \"VNF-API:network-name\": \"net_{{virtual_link_instance_name}}\",\n        \"VNF-API:network-type\": \"{{auto_virtual_link_name_for_model}}\"\n      },\n      \"VNF-API:provider-network-information\": {\n        \"VNF-API:is-external-network\": \"false\",\n        \"VNF-API:is-provider-network\": \"false\",\n        \"VNF-API:is-shared-network\": \"false\"\n      },\n      \"VNF-API:subnets\": [\n        {\n          \"VNF-API:start-address\": \"192.168.1.2\",\n          \"VNF-API:cidr-mask\": \"24\",\n          \"VNF-API:subnet-name\": \"subnet_{{virtual_link_instance_name}}\",\n          \"VNF-API:ip-version\": \"4\",\n          \"VNF-API:dhcp-enabled\": \"Y\",\n          \"VNF-API:gateway-address\": \"192.168.1.1\"\n        }\n              ]\n    },\n    \"VNF-API:sdnc-request-header\": {\n      \"VNF-API:svc-action\": \"reserve\",\n      \"VNF-API:svc-notification-url\": \"http://so.onap.org\",\n      \"VNF-API:svc-request-id\": \"postman001\"\n    }\n  }\n}\n\n"
				},
				"url": {
					"raw": "{{url-sdnc}}/restconf/operations/VNF-API:preload-network-topology-operation",
					"host": [
						"{{url-sdnc}}"
					],
					"path": [
						"restconf",
						"operations",
						"VNF-API:preload-network-topology-operation"
					]
				}
			},
			"response": []
		},
		{
			"name": "Instantiate Virtual Link",
			"event": [
				{
					"listen": "test",
					"script": {
						"id": "030a6341-9ba8-4dc4-bbe4-9818c34d5f1c",
						"exec": [
							"pm.test(\"Status code is 202\", function () {",
							"    pm.response.to.have.status(202);",
							"});",
							"",
							"var jsonData = pm.response.json();",
							"",
							"pm.globals.set(\"auto_so_request_id\", \"\"+jsonData.requestReferences.requestId+\"\");",
							"pm.globals.set(\"auto_virtual_link_instance_id\", \"\"+jsonData.requestReferences.instanceId+\"\");",
							""
						],
						"type": "text/javascript"
					}
				}
			],
			"request": {
				"method": "POST",
				"header": [
					{
						"key": "Accept",
						"value": "application/json"
					},
					{
						"key": "Content-Type",
						"value": "application/json"
					},
					{
						"key": "X-FromAppId",
						"value": "AAI"
					},
					{
						"key": "X-TransactionId",
						"value": "get_aai_subscr"
					},
					{
						"key": "Authorization",
						"value": "Basic SW5mcmFQb3J0YWxDbGllbnQ6cGFzc3dvcmQxJA=="
					}
				],
				"body": {
					"mode": "raw",
					"raw": "{\n\t\"requestDetails\": {\n\t\t\"requestInfo\": {\n\t\t\t\"instanceName\": \"net_{{virtual_link_instance_name}}\",\n\t\t\t\"source\": \"VID\",\n\t\t\t\"suppressRollback\": false,\n\t\t\t\"requestorId\": \"demo\",\n\t\t\t\"productFamilyId\": \"{{}}\"\n\t\t},\n\t\t\"modelInfo\": {\n\t\t\t\"modelType\": \"network\",\n\t\t\t\"modelInvariantId\": \"{{auto_virtual_link_invariant_uuid}}\",\n\t\t\t\"modelVersionId\": \"{{auto_virtual_link_uuid}}\",\n\t\t\t\"modelName\": \"{{auto_virtual_link_name_for_model}}\",\n\t\t\t\"modelVersion\": \"1.0\",\n\t\t\t\"modelCustomizationId\": \"{{auto_virtual_link_customization_uuid}}\",\n\t\t\t\"modelCustomizationName\": \"{{auto_virtual_link_name_for_model}}\"\n\t\t},\n    \"requestParameters\": {\n      \"userParams\": [],\n      \"aLaCarte\": true,\n\t  \"testApi\": \"VNF_API\"\n    },\n    \"cloudConfiguration\": {\n      \"lcpCloudRegionId\": \"{{onap_cloud_region_id}}\",\n      \"tenantId\": \"{{tenant_id}}\"\n    },\n\t\t\"lineOfBusiness\": {\n\t\t\t\"lineOfBusinessName\": \"{{lineofbusiness}}\"\n\t\t},\n\t\t\"platform\": {\n\t\t\t\"platformName\": \"{{platform}}\"\n\t\t},\n\t\t\"relatedInstanceList\": [{\n\t\t\t\"relatedInstance\": {\n\t\t\t\t\"instanceId\": \"{{auto_service_instance_id}}\",\n\t\t\t\t\"modelInfo\": {\n\t\t\t\t\t\"modelType\": \"service\",\n\t\t\t\t\t\"modelName\": \"{{service}}\",\n\t\t\t\t\t\"modelInvariantId\": \"{{auto_service_invariant_uuid}}\",\n\t\t\t\t\t\"modelVersion\": \"1.0\",\n\t\t\t\t\t\"modelVersionId\": \"{{auto_service_uuid}}\"\n\t\t\t\t}\n\t\t\t}\n\t\t}]\n  }\n}\n\n"
				},
				"url": {
					"raw": "{{url-so}}/onap/so/infra/serviceInstances/v6/{{auto_service_instance_id}}/networks",
					"host": [
						"{{url-so}}"
					],
					"path": [
						"onap",
						"so",
						"infra",
						"serviceInstances",
						"v6",
						"{{auto_service_instance_id}}",
						"networks"
					]
				}
			},
			"response": []
		},
		{
			"name": "SO orchestrationRequests after 10s",
			"event": [
				{
					"listen": "test",
					"script": {
						"id": "ef3be415-7453-4d2d-91ce-de6e2df05dbe",
						"exec": [
							"pm.test(\"Status code is 200\", function () {",
							"    pm.response.to.have.status(200);",
							"});",
							"var jsonData = pm.response.json();",
							"",
							"pm.globals.set(\"auto_vfmodule_instance_id\", \"\"+jsonData.request.instanceReferences.vfModuleInstanceId+\"\");",
							"tests[\"requestState is : \"+jsonData.request.requestStatus.requestState] = jsonData.request.requestStatus.requestState === \"COMPLETE\";",
							"tests[\"statusMessage is : \"+jsonData.request.requestStatus.statusMessage] = jsonData.request.requestStatus.statusMessage === \"Vf Module has been created successfully.\";"
						],
						"type": "text/javascript"
					}
				},
				{
					"listen": "prerequest",
					"script": {
						"id": "8f7cbf38-cb21-45af-9648-1915c92bcb12",
						"exec": [
							"  var date = new Date();",
							"  var curDate = null;",
							"  do {",
							"    curDate = new Date();",
							"  }",
							"  while (curDate - date < 10000);"
						],
						"type": "text/javascript"
					}
				}
			],
			"request": {
				"method": "GET",
				"header": [
					{
						"key": "Accept",
						"value": "application/json"
					},
					{
						"key": "Content-Type",
						"value": "application/json"
					},
					{
						"key": "X-FromAppId",
						"value": "AAI"
					},
					{
						"key": "X-TransactionId",
						"value": "get_aai_subscr"
					},
					{
						"key": "Authorization",
						"value": "Basic SW5mcmFQb3J0YWxDbGllbnQ6cGFzc3dvcmQxJA=="
					}
				],
				"body": {
					"mode": "raw",
					"raw": ""
				},
				"url": {
					"raw": "{{url-so}}/onap/so/infra/orchestrationRequests/v6/{{auto_so_request_id}}",
					"host": [
						"{{url-so}}"
					],
					"path": [
						"onap",
						"so",
						"infra",
						"orchestrationRequests",
						"v6",
						"{{auto_so_request_id}}"
					]
				}
			},
			"response": []
		}
	]
}