tf.Tensor(
[[876   2  14  34   4   1  56   0  13   0]
 [  2 977   0  14   1   0   4   0   2   0]
 [ 16   4 835  17  60   0  65   0   3   0]
 [ 26   9   8 893  32   2  23   0   7   0]
 [  1   3  78  43 825   0  48   0   2   0]
 [  0   0   1   1   0 943   1  44   0  10]
 [174   2 103  32 101   0 571   0  17   0]
 [  0   0   0   0   0   6   0 970   0  24]
 [  1   4   6   2   6   8  11   7 955   0]
 [  0   0   1   0   0   6   0  46   0 947]], shape=(10, 10), dtype=int32)
