Model: "sequential"
_________________________________________________________________
Layer (type)                 Output Shape              Param #   
=================================================================
conv2d (Conv2D)              (None, 26, 26, 4)         40        
_________________________________________________________________
conv2d_1 (Conv2D)            (None, 22, 22, 8)         808       
_________________________________________________________________
max_pooling2d (MaxPooling2D) (None, 20, 20, 8)         0         
_________________________________________________________________
conv2d_2 (Conv2D)            (None, 14, 14, 16)        6288      
_________________________________________________________________
conv2d_3 (Conv2D)            (None, 6, 6, 32)          41504     
_________________________________________________________________
flatten (Flatten)            (None, 1152)              0         
_________________________________________________________________
dense (Dense)                (None, 32)                36896     
_________________________________________________________________
dense_1 (Dense)              (None, 64)                2112      
_________________________________________________________________
dense_2 (Dense)              (None, 10)                650       
=================================================================
Total params: 88,298
Trainable params: 88,298
Non-trainable params: 0
_________________________________________________________________
