tf.Tensor(
[[857   5  22  22   5   2  74   1  12   0]
 [  0 978   1  15   3   0   2   0   1   0]
 [ 12   0 862   7  57   0  58   0   4   0]
 [ 27  25  16 878  31   0  19   0   3   1]
 [  2   2  83  37 796   0  75   0   5   0]
 [  0   0   0   1   0 967   0  27   1   4]
 [147   6  95  20  71   0 642   0  19   0]
 [  0   0   0   0   0  13   0 976   1  10]
 [  2   0   3   2   4   1   3   5 979   1]
 [  0   0   0   0   0   8   0  80   0 912]], shape=(10, 10), dtype=int32)
