{
  "loss": [
    1.7285598516464233,
    1.1215018033981323,
    0.7343534231185913,
    0.6814438104629517,
    0.6728578805923462,
    0.6137459874153137,
    0.5585644245147705,
    0.5780854821205139,
    0.5533167123794556,
    0.38423478603363037,
    0.3274259567260742,
    0.3218782842159271,
    0.5506382584571838,
    0.5607917904853821,
    0.5270426273345947
  ],
  "accuracy": [
    0.44999998807907104,
    0.5699999928474426,
    0.6700000166893005,
    0.7300000190734863,
    0.7200000286102295,
    0.7599999904632568,
    0.8100000023841858,
    0.7799999713897705,
    0.8199999928474426,
    0.8799999952316284,
    0.8500000238418579,
    0.8600000143051147,
    0.8199999928474426,
    0.8299999833106995,
    0.800000011920929
  ]
}