tf.Tensor(
[[848   1  18  22   3   1 102   0   5   0]
 [  2 970   1  19   3   0   3   0   2   0]
 [ 20   0 852   9  51   0  67   0   1   0]
 [ 21   9   9 886  25   0  47   0   3   0]
 [  1   0  90  23 795   0  90   0   1   0]
 [  0   0   0   1   0 975   0  12   6   6]
 [112   2  58  23  57   0 738   0  10   0]
 [  0   0   0   0   0  20   0 937   2  41]
 [  2   2   2   4   1   2  12   2 973   0]
 [  0   0   0   1   0   5   1  24   1 968]], shape=(10, 10), dtype=int32)
