{
  "project_info": {
    "project_number": "374178369104",
    "firebase_url": "https://flutter-varios-2a2b6.firebaseio.com",
    "project_id": "flutter-varios-2a2b6",
    "storage_bucket": "flutter-varios-2a2b6.appspot.com"
  },
  "client": [
    {
      "client_info": {
        "mobilesdk_app_id": "1:374178369104:android:be7b613a248e37cf3b4b55",
        "android_client_info": {
          "package_name": "com.example.push_local"
        }
      },
      "oauth_client": [
        {
          "client_id": "374178369104-f2e139ek784qt22rpec5uae9qbk2mevr.apps.googleusercontent.com",
          "client_type": 1,
          "android_info": {
            "package_name": "com.example.push_local",
            "certificate_hash": "11fceb0e4827828a4a96b4adaef926cb764840a5"
          }
        },
        {
          "client_id": "374178369104-ued59qng6obo5nvfie4uvk4lpllrrgke.apps.googleusercontent.com",
          "client_type": 3
        }
      ],
      "api_key": [
        {
          "current_key": "AIzaSyDPuyBu1l3TkECEVqPOSiHrWNaJxxPyCKc"
        }
      ],
      "services": {
        "appinvite_service": {
          "other_platform_oauth_client": [
            {
              "client_id": "374178369104-ued59qng6obo5nvfie4uvk4lpllrrgke.apps.googleusercontent.com",
              "client_type": 3
            }
          ]
        }
      }
    }
  ],
  "configuration_version": "1"
}