br/com/avicultura/chicken_tracker/Servlets/Fornecimento/FornecimentoServlet.class
br/com/avicultura/chicken_tracker/Servlets/LocalAves/ConsultaLocalAves.class
br/com/avicultura/chicken_tracker/Servlets/Vacina/VacinaServlet.class
br/com/avicultura/chicken_tracker/Servlets/Pagamento/PagamentoServlet.class
br/com/avicultura/chicken_tracker/Models/Fornecimento.class
br/com/avicultura/chicken_tracker/Models/LocalAves.class
br/com/avicultura/chicken_tracker/Servlets/Produto/ProdutoServlet.class
br/com/avicultura/chicken_tracker/Utils/EncherBanco.class
br/com/avicultura/chicken_tracker/Servlets/Negocio/ConsultaNegocio.class
br/com/avicultura/chicken_tracker/ServletListener/AppContextListener.class
br/com/avicultura/chicken_tracker/Servlets/Produto/ConsultaProduto.class
br/com/avicultura/chicken_tracker/Servlets/Login/executarLogin.class
br/com/avicultura/chicken_tracker/Servlets/Funcionario/FuncionarioServlet.class
br/com/avicultura/chicken_tracker/Hibernate/HibernateFactory.class
br/com/avicultura/chicken_tracker/Servlets/Fornecimento/ConsultaFornecimento.class
br/com/avicultura/chicken_tracker/Utils/Email$1.class
br/com/avicultura/chicken_tracker/Models/Vacina.class
br/com/avicultura/chicken_tracker/Hibernate/QueryFactory.class
br/com/avicultura/chicken_tracker/Servlets/Perfil/ConsultaPerfil.class
br/com/avicultura/chicken_tracker/Servlet/Email/EmailServlet.class
br/com/avicultura/chicken_tracker/Models/Producao.class
br/com/avicultura/chicken_tracker/Servlets/Vacina/ConsultaVacina.class
br/com/avicultura/chicken_tracker/Servlets/Producao/ConsultaProducao.class
br/com/avicultura/chicken_tracker/Models/Funcionario.class
br/com/avicultura/chicken_tracker/Servlets/Pagamento/ConsultaPagamento.class
br/com/avicultura/chicken_tracker/Servlets/Funcionario/ConsultaFuncionario.class
br/com/avicultura/chicken_tracker/Servlets/Negocio/NegocioServlet.class
br/com/avicultura/chicken_tracker/Utils/Email.class
br/com/avicultura/chicken_tracker/Models/Produto.class
br/com/avicultura/chicken_tracker/Models/Estabelecimento.class
br/com/avicultura/chicken_tracker/Servlets/Perfil/PerfilServlet.class
br/com/avicultura/chicken_tracker/Servlets/Estabelecimentos/EstabelecimentoServlet.class
Interfaces/InterfaceDAO.class
br/com/avicultura/chicken_tracker/Servlets/LocalAves/LocalAvesServlet.class
br/com/avicultura/chicken_tracker/Models/EstabelecimentoFuncionario.class
br/com/avicultura/chicken_tracker/Models/Pagamento.class
br/com/avicultura/chicken_tracker/Servlets/Fornecedor/ConsultaFornecedores.class
br/com/avicultura/chicken_tracker/Servlets/Estabelecimentos/ConsultaEstabelecimento.class
br/com/avicultura/chicken_tracker/Models/Perfil.class
br/com/avicultura/chicken_tracker/Hibernate/HibernateUtil.class
br/com/avicultura/chicken_tracker/Servlets/Fornecedor/FornecedorServlet.class
br/com/avicultura/chicken_tracker/Utils/EncherBancoAux.class
br/com/avicultura/chicken_tracker/Models/Negocio.class
br/com/avicultura/chicken_tracker/Servlet/pdf/PDF.class
