{
    "entitymodel": {
        "-xsi": "http://www.w3.org/2001/XMLSchema-instance",
        "-noNamespaceSchemaLocation": "https://ofbiz.apache.org/dtds/entitymodel.xsd",
        "title": "Entity of the Apache OFBiz Manufacturing Component",
        "description": "None",
        "version": "1.0",
        "entity": [
            {
                "-entity-name": "ProductManufacturingRule",
                "-package-name": "org.apache.ofbiz.manufacturing.bom",
                "-title": "Product To Part Rule Entity",
                "field": [
                    {
                        "-name": "ruleId",
                        "-type": "id"
                    },
                    {
                        "-name": "productId",
                        "-type": "id"
                    },
                    {
                        "-type": "id",
                        "-name": "productIdFor"
                    },
                    {
                        "-name": "productIdIn",
                        "-type": "id"
                    },
                    {
                        "-name": "ruleSeqId",
                        "-type": "id"
                    },
                    {
                        "-name": "fromDate",
                        "-type": "date-time"
                    },
                    {
                        "-type": "id",
                        "-name": "productIdInSubst"
                    },
                    {
                        "-name": "productFeature",
                        "-type": "id"
                    },
                    {
                        "-name": "ruleOperator",
                        "-type": "id"
                    },
                    {
                        "-name": "quantity",
                        "-type": "floating-point"
                    },
                    {
                        "-name": "description",
                        "-type": "description"
                    },
                    {
                        "-type": "date-time",
                        "-name": "thruDate"
                    }
                ],
                "prim-key": {
                    "-field": "ruleId"
                },
                "relation": [
                    {
                        "-rel-entity-name": "Product",
                        "key-map": {
                            "-field-name": "productId"
                        },
                        "-type": "one",
                        "-fk-name": "PRODUCT_PARENT"
                    },
                    {
                        "-type": "one",
                        "-fk-name": "PRODUCT_FOR",
                        "-title": "ProductFor",
                        "-rel-entity-name": "Product",
                        "key-map": {
                            "-field-name": "productIdFor",
                            "-rel-field-name": "productId"
                        }
                    },
                    {
                        "key-map": {
                            "-field-name": "productIdIn",
                            "-rel-field-name": "productId"
                        },
                        "-type": "one",
                        "-fk-name": "PRODUCT_IN",
                        "-title": "ProductIn",
                        "-rel-entity-name": "Product"
                    },
                    {
                        "-rel-entity-name": "Product",
                        "key-map": {
                            "-field-name": "productIdInSubst",
                            "-rel-field-name": "productId"
                        },
                        "-type": "one",
                        "-fk-name": "PRODUCT_SUBST",
                        "-title": "ProductSubst"
                    },
                    {
                        "key-map": {
                            "-field-name": "productFeature",
                            "-rel-field-name": "productFeatureId"
                        },
                        "-type": "one",
                        "-fk-name": "PRODUCT_FEAT",
                        "-rel-entity-name": "ProductFeature"
                    }
                ]
            },
            {
                "-title": "Calendar entity",
                "description": "Used to defined the availability of the machines, this entity define the Id and the week definition.\n      The Id is used in the exception calendar table as reference",
                "field": [
                    {
                        "-name": "calendarId",
                        "-type": "id"
                    },
                    {
                        "-name": "description",
                        "-type": "description"
                    },
                    {
                        "-type": "id",
                        "-name": "calendarWeekId"
                    }
                ],
                "prim-key": {
                    "-field": "calendarId"
                },
                "relation": {
                    "-rel-entity-name": "TechDataCalendarWeek",
                    "key-map": {
                        "-field-name": "calendarWeekId"
                    },
                    "-type": "one",
                    "-fk-name": "CALENDAR_WEEK"
                },
                "-entity-name": "TechDataCalendar",
                "-package-name": "org.apache.ofbiz.manufacturing.techdata",
                "-default-resource-name": "ManufacturingEntityLabels"
            },
            {
                "-entity-name": "TechDataCalendarExcDay",
                "-package-name": "org.apache.ofbiz.manufacturing.techdata",
                "-title": "Calendar Exception Day entity",
                "description": "Used to defined some days which differ from the normal day definition in the weekId associated in the calendar.",
                "field": [
                    {
                        "-name": "calendarId",
                        "-type": "id"
                    },
                    {
                        "-name": "exceptionDateStartTime",
                        "-type": "date-time"
                    },
                    {
                        "-name": "exceptionCapacity",
                        "-type": "fixed-point"
                    },
                    {
                        "-name": "usedCapacity",
                        "-type": "fixed-point"
                    },
                    {
                        "-name": "description",
                        "-type": "description"
                    }
                ],
                "prim-key": [
                    {
                        "-field": "calendarId"
                    },
                    {
                        "-field": "exceptionDateStartTime"
                    }
                ],
                "relation": {
                    "-type": "one",
                    "-fk-name": "EXC_DAY_CALENDAR",
                    "-rel-entity-name": "TechDataCalendar",
                    "key-map": {
                        "-field-name": "calendarId"
                    }
                }
            },
            {
                "field": [
                    {
                        "-name": "calendarId",
                        "-type": "id"
                    },
                    {
                        "-type": "date",
                        "-name": "exceptionDateStart"
                    },
                    {
                        "-name": "calendarWeekId",
                        "-type": "id"
                    },
                    {
                        "-name": "description",
                        "-type": "description"
                    }
                ],
                "prim-key": [
                    {
                        "-field": "calendarId"
                    },
                    {
                        "-field": "exceptionDateStart"
                    }
                ],
                "relation": [
                    {
                        "-fk-name": "EXC_WEEK_CALENDAR",
                        "-rel-entity-name": "TechDataCalendar",
                        "key-map": {
                            "-field-name": "calendarId"
                        },
                        "-type": "one"
                    },
                    {
                        "-rel-entity-name": "TechDataCalendarWeek",
                        "key-map": {
                            "-field-name": "calendarWeekId"
                        },
                        "-type": "one",
                        "-fk-name": "EXC_WEEK_WEEK"
                    }
                ],
                "-entity-name": "TechDataCalendarExcWeek",
                "-package-name": "org.apache.ofbiz.manufacturing.techdata",
                "-title": "Calendar Exception Week entity",
                "description": "Used to defined some weeks which differ from the normal week defined in the calendar."
            },
            {
                "field": [
                    {
                        "-name": "calendarWeekId",
                        "-type": "id"
                    },
                    {
                        "-name": "description",
                        "-type": "description"
                    },
                    {
                        "-name": "mondayStartTime",
                        "-type": "time"
                    },
                    {
                        "-name": "mondayCapacity",
                        "-type": "floating-point"
                    },
                    {
                        "-name": "tuesdayStartTime",
                        "-type": "time"
                    },
                    {
                        "-name": "tuesdayCapacity",
                        "-type": "floating-point"
                    },
                    {
                        "-name": "wednesdayStartTime",
                        "-type": "time"
                    },
                    {
                        "-type": "floating-point",
                        "-name": "wednesdayCapacity"
                    },
                    {
                        "-type": "time",
                        "-name": "thursdayStartTime"
                    },
                    {
                        "-name": "thursdayCapacity",
                        "-type": "floating-point"
                    },
                    {
                        "-name": "fridayStartTime",
                        "-type": "time"
                    },
                    {
                        "-name": "fridayCapacity",
                        "-type": "floating-point"
                    },
                    {
                        "-name": "saturdayStartTime",
                        "-type": "time"
                    },
                    {
                        "-name": "saturdayCapacity",
                        "-type": "floating-point"
                    },
                    {
                        "-type": "time",
                        "-name": "sundayStartTime"
                    },
                    {
                        "-name": "sundayCapacity",
                        "-type": "floating-point"
                    }
                ],
                "prim-key": {
                    "-field": "calendarWeekId"
                },
                "-entity-name": "TechDataCalendarWeek",
                "-package-name": "org.apache.ofbiz.manufacturing.techdata",
                "-default-resource-name": "ManufacturingEntityLabels",
                "-title": "Week definition entity",
                "description": "Used to defined the week definition disponibility for machine"
            },
            {
                "-title": "MRP Event Type",
                "description": "",
                "field": [
                    {
                        "-name": "mrpEventTypeId",
                        "-type": "id"
                    },
                    {
                        "-name": "description",
                        "-type": "description"
                    }
                ],
                "prim-key": {
                    "-field": "mrpEventTypeId"
                },
                "-entity-name": "MrpEventType",
                "-package-name": "org.apache.ofbiz.manufacturing.mrp",
                "-default-resource-name": "ManufacturingEntityLabels"
            },
            {
                "-entity-name": "MrpEvent",
                "-package-name": "org.apache.ofbiz.manufacturing.mrp",
                "-title": "MRP Event",
                "description": "",
                "field": [
                    {
                        "-name": "mrpId",
                        "-type": "id"
                    },
                    {
                        "-name": "productId",
                        "-type": "id"
                    },
                    {
                        "-name": "eventDate",
                        "-type": "date-time"
                    },
                    {
                        "-name": "mrpEventTypeId",
                        "-type": "id"
                    },
                    {
                        "-name": "facilityId",
                        "-type": "id"
                    },
                    {
                        "-type": "floating-point",
                        "-name": "quantity"
                    },
                    {
                        "-name": "eventName",
                        "-type": "very-long"
                    },
                    {
                        "-name": "isLate",
                        "-type": "indicator"
                    }
                ],
                "prim-key": [
                    {
                        "-field": "mrpId"
                    },
                    {
                        "-field": "productId"
                    },
                    {
                        "-field": "eventDate"
                    },
                    {
                        "-field": "mrpEventTypeId"
                    }
                ],
                "relation": [
                    {
                        "key-map": {
                            "-field-name": "productId"
                        },
                        "-type": "one",
                        "-fk-name": "MRPEV_PROD",
                        "-rel-entity-name": "Product"
                    },
                    {
                        "-rel-entity-name": "MrpEventType",
                        "key-map": {
                            "-field-name": "mrpEventTypeId"
                        },
                        "-type": "one",
                        "-fk-name": "MRPEV_TYP"
                    },
                    {
                        "-type": "one",
                        "-fk-name": "MRPEV_FAC",
                        "-rel-entity-name": "Facility",
                        "key-map": {
                            "-field-name": "facilityId"
                        }
                    }
                ]
            }
        ],
        "view-entity": {
            "alias-all": {
                "-entity-alias": "MEV"
            },
            "alias": {
                "-entity-alias": "PR",
                "-name": "billOfMaterialLevel"
            },
            "view-link": {
                "-entity-alias": "MEV",
                "-rel-entity-alias": "PR",
                "key-map": {
                    "-field-name": "productId"
                }
            },
            "relation": {
                "-rel-entity-name": "Product",
                "-type": "one-nofk",
                "key-map": {
                    "-field-name": "productId"
                }
            },
            "-entity-name": "MrpEventView",
            "-package-name": "org.apache.ofbiz.manufacturing.mrp",
            "-title": "MRP Event View",
            "member-entity": [
                {
                    "-entity-alias": "MEV",
                    "-entity-name": "MrpEvent"
                },
                {
                    "-entity-alias": "PR",
                    "-entity-name": "Product"
                }
            ]
        }
    }
}