{
    "entity-engine-xml": {
        "OrderItemType": [
            {
                "-description": "Purchase Order Specific",
                "-hasTable": "N",
                "-orderItemTypeId": "PURCHASE_SPECIFIC",
                "-parentTypeId": ""
            },
            {
                "-description": "PO: Inventory",
                "-hasTable": "N",
                "-orderItemTypeId": "INVENTORY_ORDER_ITEM",
                "-parentTypeId": "PURCHASE_SPECIFIC"
            },
            {
                "-description": "PO: Supplies (to Expense)",
                "-hasTable": "N",
                "-orderItemTypeId": "SUPPLIES_ORDER_ITEM",
                "-parentTypeId": "PURCHASE_SPECIFIC"
            },
            {
                "-description": "PO: Fixed Asset",
                "-hasTable": "N",
                "-orderItemTypeId": "ASSET_ORDER_ITEM",
                "-parentTypeId": "PURCHASE_SPECIFIC"
            },
            {
                "-description": "Product Item",
                "-hasTable": "N",
                "-orderItemTypeId": "PRODUCT_ORDER_ITEM",
                "-parentTypeId": ""
            },
            {
                "-description": "Work Item",
                "-hasTable": "N",
                "-orderItemTypeId": "WORK_ORDER_ITEM",
                "-parentTypeId": ""
            },
            {
                "-orderItemTypeId": "RENTAL_ORDER_ITEM",
                "-parentTypeId": "",
                "-description": "Rental Item",
                "-hasTable": "N"
            },
            {
                "-description": "Bulk Item",
                "-hasTable": "N",
                "-orderItemTypeId": "BULK_ORDER_ITEM",
                "-parentTypeId": ""
            }
        ],
        "EnumerationType": [
            {
                "-description": "Order Sales Channel",
                "-enumTypeId": "ORDER_SALES_CHANNEL",
                "-hasTable": "N",
                "-parentTypeId": ""
            },
            {
                "-parentTypeId": "",
                "-description": "Order Item Change Type",
                "-enumTypeId": "ODR_ITM_CHANGE_TYPE",
                "-hasTable": "N"
            },
            {
                "-description": "Order Item Change Reason",
                "-enumTypeId": "ODR_ITM_CH_REASON",
                "-hasTable": "N",
                "-parentTypeId": ""
            }
        ],
        "ReturnAdjustmentType": [
            {
                "-description": "Return Promotion",
                "-hasTable": "N",
                "-returnAdjustmentTypeId": "RET_PROMOTION_ADJ",
                "-parentTypeId": ""
            },
            {
                "-description": "Return Replacement",
                "-hasTable": "N",
                "-returnAdjustmentTypeId": "RET_REPLACE_ADJ",
                "-parentTypeId": ""
            },
            {
                "-hasTable": "N",
                "-returnAdjustmentTypeId": "RET_DISCOUNT_ADJ",
                "-parentTypeId": "",
                "-description": "Return Discount"
            },
            {
                "-description": "Return Fee",
                "-hasTable": "N",
                "-returnAdjustmentTypeId": "RET_FEE_ADJ",
                "-parentTypeId": ""
            },
            {
                "-hasTable": "N",
                "-returnAdjustmentTypeId": "RET_MISC_ADJ",
                "-parentTypeId": "",
                "-description": "Return Miscellaneous Charges"
            },
            {
                "-parentTypeId": "",
                "-description": "Return Sales Tax",
                "-hasTable": "N",
                "-returnAdjustmentTypeId": "RET_SALES_TAX_ADJ"
            },
            {
                "-returnAdjustmentTypeId": "RET_VAT_TAX_ADJ",
                "-parentTypeId": "",
                "-description": "Return VAT Tax",
                "-hasTable": "N"
            },
            {
                "-parentTypeId": "",
                "-description": "Return VAT Price Correction",
                "-hasTable": "N",
                "-returnAdjustmentTypeId": "RET_VAT_PC_ADJ"
            },
            {
                "-description": "Return Shipping and Handling",
                "-hasTable": "N",
                "-returnAdjustmentTypeId": "RET_SHIPPING_ADJ",
                "-parentTypeId": ""
            },
            {
                "-description": "Return Surcharge",
                "-hasTable": "N",
                "-returnAdjustmentTypeId": "RET_SURCHARGE_ADJ",
                "-parentTypeId": ""
            },
            {
                "-description": "Return Additional Feature",
                "-hasTable": "N",
                "-returnAdjustmentTypeId": "RET_ADD_FEATURE_ADJ",
                "-parentTypeId": ""
            },
            {
                "-parentTypeId": "",
                "-description": "Return Warranty",
                "-hasTable": "N",
                "-returnAdjustmentTypeId": "RET_WARRANTY_ADJ"
            },
            {
                "-description": "Return Marketing Package Adjustment",
                "-hasTable": "N",
                "-returnAdjustmentTypeId": "RET_MKTG_PKG_ADJ",
                "-parentTypeId": ""
            },
            {
                "-description": "Return Manual Adjustment",
                "-hasTable": "N",
                "-returnAdjustmentTypeId": "RET_MAN_ADJ",
                "-parentTypeId": ""
            }
        ],
        "CustRequestResolution": [
            {
                "-custRequestResolutionId": "FIXED",
                "-custRequestTypeId": "RF_BUGFIX",
                "-description": "Fixed"
            },
            {
                "-custRequestResolutionId": "WORKS",
                "-custRequestTypeId": "RF_BUGFIX",
                "-description": "Works For Me"
            },
            {
                "-custRequestResolutionId": "WONTFIX",
                "-custRequestTypeId": "RF_BUGFIX",
                "-description": "Won't Fix"
            },
            {
                "-custRequestResolutionId": "DUPLICATE",
                "-custRequestTypeId": "RF_FEATURE",
                "-description": "Duplicate"
            },
            {
                "-custRequestResolutionId": "REJECTED",
                "-custRequestTypeId": "RF_FEATURE",
                "-description": "Rejected"
            },
            {
                "-custRequestTypeId": "RF_FEATURE",
                "-description": "Implemented",
                "-custRequestResolutionId": "IMPLEMENTED"
            }
        ],
        "QuoteType": [
            {
                "-hasTable": "N",
                "-parentTypeId": "",
                "-quoteTypeId": "OTHER_QUOTE",
                "-description": "Other"
            },
            {
                "-parentTypeId": "",
                "-quoteTypeId": "PRODUCT_QUOTE",
                "-description": "Product",
                "-hasTable": "N"
            },
            {
                "-quoteTypeId": "PROPOSAL",
                "-description": "Proposal",
                "-hasTable": "N",
                "-parentTypeId": ""
            },
            {
                "-description": "Product Purchase",
                "-hasTable": "N",
                "-parentTypeId": "",
                "-quoteTypeId": "PURCHASE_QUOTE"
            }
        ],
        "StatusItem": [
            {
                "-description": "Created",
                "-sequenceId": "01",
                "-statusCode": "CREATED",
                "-statusId": "ORDER_CREATED",
                "-statusTypeId": "ORDER_STATUS"
            },
            {
                "-statusCode": "PROCESSING",
                "-statusId": "ORDER_PROCESSING",
                "-statusTypeId": "ORDER_STATUS",
                "-description": "Processing",
                "-sequenceId": "04"
            },
            {
                "-description": "Approved",
                "-sequenceId": "05",
                "-statusCode": "APPROVED",
                "-statusId": "ORDER_APPROVED",
                "-statusTypeId": "ORDER_STATUS"
            },
            {
                "-statusCode": "SENT",
                "-statusId": "ORDER_SENT",
                "-statusTypeId": "ORDER_STATUS",
                "-description": "Sent",
                "-sequenceId": "03"
            },
            {
                "-description": "Held",
                "-sequenceId": "06",
                "-statusCode": "HELD",
                "-statusId": "ORDER_HOLD",
                "-statusTypeId": "ORDER_STATUS"
            },
            {
                "-description": "Completed",
                "-sequenceId": "10",
                "-statusCode": "COMPLETED",
                "-statusId": "ORDER_COMPLETED",
                "-statusTypeId": "ORDER_STATUS"
            },
            {
                "-statusId": "ORDER_REJECTED",
                "-statusTypeId": "ORDER_STATUS",
                "-description": "Rejected",
                "-sequenceId": "98",
                "-statusCode": "REJECTED"
            },
            {
                "-statusCode": "CANCELLED",
                "-statusId": "ORDER_CANCELLED",
                "-statusTypeId": "ORDER_STATUS",
                "-description": "Cancelled",
                "-sequenceId": "99"
            },
            {
                "-statusId": "ITEM_CREATED",
                "-statusTypeId": "ORDER_ITEM_STATUS",
                "-description": "Created",
                "-sequenceId": "01",
                "-statusCode": "CREATED"
            },
            {
                "-description": "Approved",
                "-sequenceId": "05",
                "-statusCode": "APPROVED",
                "-statusId": "ITEM_APPROVED",
                "-statusTypeId": "ORDER_ITEM_STATUS"
            },
            {
                "-description": "Completed",
                "-sequenceId": "10",
                "-statusCode": "COMPLETED",
                "-statusId": "ITEM_COMPLETED",
                "-statusTypeId": "ORDER_ITEM_STATUS"
            },
            {
                "-statusCode": "REJECTED",
                "-statusId": "ITEM_REJECTED",
                "-statusTypeId": "ORDER_ITEM_STATUS",
                "-description": "Rejected",
                "-sequenceId": "98"
            },
            {
                "-statusTypeId": "ORDER_ITEM_STATUS",
                "-description": "Cancelled",
                "-sequenceId": "99",
                "-statusCode": "CANCELLED",
                "-statusId": "ITEM_CANCELLED"
            },
            {
                "-statusId": "PAYMENT_NOT_RECEIVED",
                "-statusTypeId": "PAYMENT_PREF_STATUS",
                "-description": "Not-Received",
                "-sequenceId": "01",
                "-statusCode": "NOT_RECEIVED"
            },
            {
                "-statusCode": "RECEIVED",
                "-statusId": "PAYMENT_RECEIVED",
                "-statusTypeId": "PAYMENT_PREF_STATUS",
                "-description": "Received",
                "-sequenceId": "02"
            },
            {
                "-statusId": "PAYMENT_NOT_AUTH",
                "-statusTypeId": "PAYMENT_PREF_STATUS",
                "-description": "Not-Authorized",
                "-sequenceId": "01",
                "-statusCode": "NOT_AUTHORIZED"
            },
            {
                "-statusTypeId": "PAYMENT_PREF_STATUS",
                "-description": "Authorized",
                "-sequenceId": "02",
                "-statusCode": "AUTHORIZED",
                "-statusId": "PAYMENT_AUTHORIZED"
            },
            {
                "-sequenceId": "03",
                "-statusCode": "SETTLED",
                "-statusId": "PAYMENT_SETTLED",
                "-statusTypeId": "PAYMENT_PREF_STATUS",
                "-description": "Settled"
            },
            {
                "-description": "Declined",
                "-sequenceId": "04",
                "-statusCode": "DECLINED",
                "-statusId": "PAYMENT_DECLINED",
                "-statusTypeId": "PAYMENT_PREF_STATUS"
            },
            {
                "-description": "Refunded",
                "-sequenceId": "05",
                "-statusCode": "REFUNDED",
                "-statusId": "PAYMENT_REFUNDED",
                "-statusTypeId": "PAYMENT_PREF_STATUS"
            },
            {
                "-description": "Cancelled",
                "-sequenceId": "99",
                "-statusCode": "CANCELLED",
                "-statusId": "PAYMENT_CANCELLED",
                "-statusTypeId": "PAYMENT_PREF_STATUS"
            },
            {
                "-statusCode": "SUBMITTED",
                "-statusId": "ODS_SUBMITTED",
                "-statusTypeId": "ORDER_DEL_SCH",
                "-description": "Supplier Submitted",
                "-sequenceId": "01"
            },
            {
                "-description": "Accepted",
                "-sequenceId": "02",
                "-statusCode": "ACCEPTED",
                "-statusId": "ODS_ACCEPTED",
                "-statusTypeId": "ORDER_DEL_SCH"
            },
            {
                "-description": "Schedule Approved",
                "-sequenceId": "03",
                "-statusCode": "APPROVED",
                "-statusId": "ODS_APPROVED",
                "-statusTypeId": "ORDER_DEL_SCH"
            },
            {
                "-description": "Delivery Arranged",
                "-sequenceId": "04",
                "-statusCode": "ARRANGED",
                "-statusId": "ODS_ARRANGED",
                "-statusTypeId": "ORDER_DEL_SCH"
            },
            {
                "-description": "Delivery Cancelled",
                "-sequenceId": "99",
                "-statusCode": "CANCELLED",
                "-statusId": "ODS_CANCELLED",
                "-statusTypeId": "ORDER_DEL_SCH"
            },
            {
                "-description": "Requested",
                "-sequenceId": "01",
                "-statusCode": "REQUESTED",
                "-statusId": "RETURN_REQUESTED",
                "-statusTypeId": "ORDER_RETURN_STTS"
            },
            {
                "-description": "Accepted",
                "-sequenceId": "02",
                "-statusCode": "ACCEPTED",
                "-statusId": "RETURN_ACCEPTED",
                "-statusTypeId": "ORDER_RETURN_STTS"
            },
            {
                "-description": "Received",
                "-sequenceId": "03",
                "-statusCode": "RECEIVED",
                "-statusId": "RETURN_RECEIVED",
                "-statusTypeId": "ORDER_RETURN_STTS"
            },
            {
                "-description": "Completed",
                "-sequenceId": "10",
                "-statusCode": "COMPLETED",
                "-statusId": "RETURN_COMPLETED",
                "-statusTypeId": "ORDER_RETURN_STTS"
            },
            {
                "-statusCode": "MANUAL_REFUND",
                "-statusId": "RETURN_MAN_REFUND",
                "-statusTypeId": "ORDER_RETURN_STTS",
                "-description": "Manual Refund Required",
                "-sequenceId": "11"
            },
            {
                "-description": "Cancelled",
                "-sequenceId": "99",
                "-statusCode": "CANCELLED",
                "-statusId": "RETURN_CANCELLED",
                "-statusTypeId": "ORDER_RETURN_STTS"
            },
            {
                "-description": "Requested",
                "-sequenceId": "01",
                "-statusCode": "REQUESTED",
                "-statusId": "SUP_RETURN_REQUESTED",
                "-statusTypeId": "PORDER_RETURN_STTS"
            },
            {
                "-statusTypeId": "PORDER_RETURN_STTS",
                "-description": "Accepted",
                "-sequenceId": "02",
                "-statusCode": "ACCEPTED",
                "-statusId": "SUP_RETURN_ACCEPTED"
            },
            {
                "-sequenceId": "03",
                "-statusCode": "SHIPPED",
                "-statusId": "SUP_RETURN_SHIPPED",
                "-statusTypeId": "PORDER_RETURN_STTS",
                "-description": "Shipped"
            },
            {
                "-sequenceId": "10",
                "-statusCode": "COMPLETED",
                "-statusId": "SUP_RETURN_COMPLETED",
                "-statusTypeId": "PORDER_RETURN_STTS",
                "-description": "Completed"
            },
            {
                "-description": "Cancelled",
                "-sequenceId": "99",
                "-statusCode": "CANCELLED",
                "-statusId": "SUP_RETURN_CANCELLED",
                "-statusTypeId": "PORDER_RETURN_STTS"
            },
            {
                "-statusId": "CRQ_DRAFT",
                "-statusTypeId": "CUSTREQ_STTS",
                "-description": "Draft",
                "-sequenceId": "00",
                "-statusCode": "DRAFT"
            },
            {
                "-description": "Submitted",
                "-sequenceId": "01",
                "-statusCode": "SUBMITTED",
                "-statusId": "CRQ_SUBMITTED",
                "-statusTypeId": "CUSTREQ_STTS"
            },
            {
                "-description": "Accepted",
                "-sequenceId": "02",
                "-statusCode": "ACCEPTED",
                "-statusId": "CRQ_ACCEPTED",
                "-statusTypeId": "CUSTREQ_STTS"
            },
            {
                "-sequenceId": "03",
                "-statusCode": "REVIEWED",
                "-statusId": "CRQ_REVIEWED",
                "-statusTypeId": "CUSTREQ_STTS",
                "-description": "Reviewed"
            },
            {
                "-statusTypeId": "CUSTREQ_STTS",
                "-description": "Pending Cust.",
                "-sequenceId": "09",
                "-statusCode": "PENDING",
                "-statusId": "CRQ_PENDING"
            },
            {
                "-sequenceId": "04",
                "-statusCode": "COMPLETED",
                "-statusId": "CRQ_COMPLETED",
                "-statusTypeId": "CUSTREQ_STTS",
                "-description": "Completed"
            },
            {
                "-statusTypeId": "CUSTREQ_STTS",
                "-description": "Rejected",
                "-sequenceId": "98",
                "-statusCode": "REJECTED",
                "-statusId": "CRQ_REJECTED"
            },
            {
                "-description": "Cancelled",
                "-sequenceId": "99",
                "-statusCode": "CANCELLED",
                "-statusId": "CRQ_CANCELLED",
                "-statusTypeId": "CUSTREQ_STTS"
            },
            {
                "-statusCode": "PROPOSED",
                "-statusId": "REQ_PROPOSED",
                "-statusTypeId": "REQUIREMENT_STATUS",
                "-description": "Proposed",
                "-sequenceId": "01"
            },
            {
                "-description": "Created",
                "-sequenceId": "01",
                "-statusCode": "CREATED",
                "-statusId": "REQ_CREATED",
                "-statusTypeId": "REQUIREMENT_STATUS"
            },
            {
                "-sequenceId": "02",
                "-statusCode": "APPROVED",
                "-statusId": "REQ_APPROVED",
                "-statusTypeId": "REQUIREMENT_STATUS",
                "-description": "Approved"
            },
            {
                "-statusTypeId": "REQUIREMENT_STATUS",
                "-description": "Ordered",
                "-sequenceId": "03",
                "-statusCode": "ORDERED",
                "-statusId": "REQ_ORDERED"
            },
            {
                "-description": "Rejected",
                "-sequenceId": "98",
                "-statusCode": "REJECTED",
                "-statusId": "REQ_REJECTED",
                "-statusTypeId": "REQUIREMENT_STATUS"
            },
            {
                "-statusCode": "CREATED",
                "-statusId": "QUO_CREATED",
                "-statusTypeId": "QUOTE_STATUS",
                "-description": "Created",
                "-sequenceId": "01"
            },
            {
                "-description": "Approved",
                "-sequenceId": "02",
                "-statusCode": "APPROVED",
                "-statusId": "QUO_APPROVED",
                "-statusTypeId": "QUOTE_STATUS"
            },
            {
                "-sequenceId": "03",
                "-statusCode": "ORDERED",
                "-statusId": "QUO_ORDERED",
                "-statusTypeId": "QUOTE_STATUS",
                "-description": "Ordered"
            },
            {
                "-description": "Rejected",
                "-sequenceId": "98",
                "-statusCode": "REJECTED",
                "-statusId": "QUO_REJECTED",
                "-statusTypeId": "QUOTE_STATUS"
            }
        ],
        "StatusValidChange": [
            {
                "-statusId": "ORDER_CREATED",
                "-statusIdTo": "ORDER_PROCESSING",
                "-transitionName": "Process Order"
            },
            {
                "-statusId": "ORDER_CREATED",
                "-statusIdTo": "ORDER_APPROVED",
                "-transitionName": "Approve Order"
            },
            {
                "-statusIdTo": "ORDER_HOLD",
                "-transitionName": "Hold Order",
                "-statusId": "ORDER_CREATED"
            },
            {
                "-statusId": "ORDER_CREATED",
                "-statusIdTo": "ORDER_REJECTED",
                "-transitionName": "Reject Order"
            },
            {
                "-statusId": "ORDER_CREATED",
                "-statusIdTo": "ORDER_CANCELLED",
                "-transitionName": "Cancel Order"
            },
            {
                "-statusId": "ORDER_PROCESSING",
                "-statusIdTo": "ORDER_HOLD",
                "-transitionName": "Hold Order"
            },
            {
                "-statusId": "ORDER_PROCESSING",
                "-statusIdTo": "ORDER_APPROVED",
                "-transitionName": "Approve Order"
            },
            {
                "-statusId": "ORDER_PROCESSING",
                "-statusIdTo": "ORDER_REJECTED",
                "-transitionName": "Reject Order"
            },
            {
                "-statusId": "ORDER_PROCESSING",
                "-statusIdTo": "ORDER_CANCELLED",
                "-transitionName": "Cancel Order"
            },
            {
                "-statusId": "ORDER_APPROVED",
                "-statusIdTo": "ORDER_SENT",
                "-transitionName": "Send Order"
            },
            {
                "-statusId": "ORDER_APPROVED",
                "-statusIdTo": "ORDER_PROCESSING",
                "-transitionName": "Process Order"
            },
            {
                "-statusId": "ORDER_APPROVED",
                "-statusIdTo": "ORDER_COMPLETED",
                "-transitionName": "Complete Order"
            },
            {
                "-transitionName": "Cancel Order",
                "-statusId": "ORDER_APPROVED",
                "-statusIdTo": "ORDER_CANCELLED"
            },
            {
                "-statusId": "ORDER_APPROVED",
                "-statusIdTo": "ORDER_HOLD",
                "-transitionName": "Hold Order"
            },
            {
                "-statusId": "ORDER_HOLD",
                "-statusIdTo": "ORDER_PROCESSING",
                "-transitionName": "Process Order"
            },
            {
                "-statusIdTo": "ORDER_APPROVED",
                "-transitionName": "Approve Order",
                "-statusId": "ORDER_HOLD"
            },
            {
                "-statusId": "ORDER_HOLD",
                "-statusIdTo": "ORDER_CANCELLED",
                "-transitionName": "Cancel Order"
            },
            {
                "-statusId": "ORDER_SENT",
                "-statusIdTo": "ORDER_COMPLETED",
                "-transitionName": "Order Completed"
            },
            {
                "-statusId": "ORDER_SENT",
                "-statusIdTo": "ORDER_CANCELLED",
                "-transitionName": "Order Cancelled"
            },
            {
                "-statusIdTo": "ORDER_APPROVED",
                "-transitionName": "Approve Order",
                "-statusId": "ORDER_COMPLETED"
            },
            {
                "-statusId": "ITEM_CREATED",
                "-statusIdTo": "ITEM_APPROVED",
                "-transitionName": "Approve Item"
            },
            {
                "-transitionName": "Reject Item",
                "-statusId": "ITEM_CREATED",
                "-statusIdTo": "ITEM_REJECTED"
            },
            {
                "-statusId": "ITEM_CREATED",
                "-statusIdTo": "ITEM_CANCELLED",
                "-transitionName": "Cancel Item"
            },
            {
                "-statusId": "ITEM_APPROVED",
                "-statusIdTo": "ITEM_COMPLETED",
                "-transitionName": "Complete Item"
            },
            {
                "-statusId": "ITEM_APPROVED",
                "-statusIdTo": "ITEM_CANCELLED",
                "-transitionName": "Cancel Item"
            },
            {
                "-statusId": "ITEM_COMPLETED",
                "-statusIdTo": "ITEM_APPROVED",
                "-transitionName": "Approve Item"
            },
            {
                "-statusIdTo": "PAYMENT_RECEIVED",
                "-transitionName": "Payment Received",
                "-statusId": "PAYMENT_NOT_RECEIVED"
            },
            {
                "-statusId": "PAYMENT_NOT_RECEIVED",
                "-statusIdTo": "PAYMENT_CANCELLED",
                "-transitionName": "Payment Cancelled"
            },
            {
                "-transitionName": "Payment Authorized",
                "-statusId": "PAYMENT_NOT_AUTH",
                "-statusIdTo": "PAYMENT_AUTHORIZED"
            },
            {
                "-statusId": "PAYMENT_NOT_AUTH",
                "-statusIdTo": "PAYMENT_CANCELLED",
                "-transitionName": "Payment Cancelled"
            },
            {
                "-statusId": "PAYMENT_AUTHORIZED",
                "-statusIdTo": "PAYMENT_SETTLED",
                "-transitionName": "Payment Settled"
            },
            {
                "-transitionName": "Payment Cancelled",
                "-statusId": "PAYMENT_AUTHORIZED",
                "-statusIdTo": "PAYMENT_CANCELLED"
            },
            {
                "-transitionName": "Payment Refunded",
                "-statusId": "PAYMENT_SETTLED",
                "-statusIdTo": "PAYMENT_REFUNDED"
            },
            {
                "-statusId": "ODS_SUBMITTED",
                "-statusIdTo": "ODS_ACCEPTED",
                "-transitionName": "Accept Delivery Information"
            },
            {
                "-transitionName": "Approve Delivery Schedule",
                "-statusId": "ODS_ACCEPTED",
                "-statusIdTo": "ODS_APPROVED"
            },
            {
                "-statusId": "ODS_APPROVED",
                "-statusIdTo": "ODS_ARRANGED",
                "-transitionName": "Arrange Delivery"
            },
            {
                "-statusId": "ODS_SUBMITTED",
                "-statusIdTo": "ODS_CANCELLED",
                "-transitionName": "Cancel Delivery"
            },
            {
                "-statusId": "ODS_ACCEPTED",
                "-statusIdTo": "ODS_CANCELLED",
                "-transitionName": "Cancel Delivery"
            },
            {
                "-transitionName": "Cancel Delivery",
                "-statusId": "ODS_APPROVED",
                "-statusIdTo": "ODS_CANCELLED"
            },
            {
                "-statusId": "ODS_ARRANGED",
                "-statusIdTo": "ODS_CANCELLED",
                "-transitionName": "Cancel Delivery"
            },
            {
                "-statusId": "RETURN_REQUESTED",
                "-statusIdTo": "RETURN_ACCEPTED",
                "-transitionName": "Requested Return Accepted"
            },
            {
                "-statusId": "RETURN_REQUESTED",
                "-statusIdTo": "RETURN_CANCELLED",
                "-transitionName": "Requested Return Cancelled"
            },
            {
                "-statusId": "RETURN_ACCEPTED",
                "-statusIdTo": "RETURN_RECEIVED",
                "-transitionName": "Accepted Return Received"
            },
            {
                "-statusId": "RETURN_ACCEPTED",
                "-statusIdTo": "RETURN_CANCELLED",
                "-transitionName": "Accepted Return Cancelled"
            },
            {
                "-statusId": "RETURN_RECEIVED",
                "-statusIdTo": "RETURN_COMPLETED",
                "-transitionName": "Received Return Completed"
            },
            {
                "-statusId": "RETURN_RECEIVED",
                "-statusIdTo": "RETURN_CANCELLED",
                "-transitionName": "Received Return Cancelled"
            },
            {
                "-statusId": "RETURN_RECEIVED",
                "-statusIdTo": "RETURN_MAN_REFUND",
                "-transitionName": "Received Return Requires Manual Refund"
            },
            {
                "-statusId": "SUP_RETURN_REQUESTED",
                "-statusIdTo": "SUP_RETURN_ACCEPTED",
                "-transitionName": "Requested Return Accepted"
            },
            {
                "-transitionName": "Requested Return Cancelled",
                "-statusId": "SUP_RETURN_REQUESTED",
                "-statusIdTo": "SUP_RETURN_CANCELLED"
            },
            {
                "-statusId": "SUP_RETURN_ACCEPTED",
                "-statusIdTo": "SUP_RETURN_SHIPPED",
                "-transitionName": "Accepted Return Shipped"
            },
            {
                "-statusId": "SUP_RETURN_ACCEPTED",
                "-statusIdTo": "SUP_RETURN_CANCELLED",
                "-transitionName": "Accepted Return Cancelled"
            },
            {
                "-statusId": "SUP_RETURN_SHIPPED",
                "-statusIdTo": "SUP_RETURN_COMPLETED",
                "-transitionName": "Shipped Return Completed"
            },
            {
                "-statusId": "SUP_RETURN_SHIPPED",
                "-statusIdTo": "SUP_RETURN_CANCELLED",
                "-transitionName": "Shipped Return Cancelled"
            },
            {
                "-statusId": "CRQ_DRAFT",
                "-statusIdTo": "CRQ_ACCEPTED",
                "-transitionName": "Accept Request"
            },
            {
                "-transitionName": "Submit Request",
                "-statusId": "CRQ_DRAFT",
                "-statusIdTo": "CRQ_SUBMITTED"
            },
            {
                "-statusId": "CRQ_DRAFT",
                "-statusIdTo": "CRQ_CANCELLED",
                "-transitionName": "Cancel Request"
            },
            {
                "-statusId": "CRQ_SUBMITTED",
                "-statusIdTo": "CRQ_ACCEPTED",
                "-transitionName": "Accept Request"
            },
            {
                "-transitionName": "Complete Request",
                "-statusId": "CRQ_SUBMITTED",
                "-statusIdTo": "CRQ_COMPLETED"
            },
            {
                "-statusId": "CRQ_SUBMITTED",
                "-statusIdTo": "CRQ_REJECTED",
                "-transitionName": "Reject Request"
            },
            {
                "-statusId": "CRQ_SUBMITTED",
                "-statusIdTo": "CRQ_CANCELLED",
                "-transitionName": "Cancel Request"
            },
            {
                "-transitionName": "Pending customer",
                "-statusId": "CRQ_SUBMITTED",
                "-statusIdTo": "CRQ_PENDING"
            },
            {
                "-statusId": "CRQ_PENDING",
                "-statusIdTo": "CRQ_SUBMITTED",
                "-transitionName": "Submit Request"
            },
            {
                "-statusId": "CRQ_PENDING",
                "-statusIdTo": "CRQ_ACCEPTED",
                "-transitionName": "Accept Request"
            },
            {
                "-statusId": "CRQ_PENDING",
                "-statusIdTo": "CRQ_REVIEWED",
                "-transitionName": "Review Request"
            },
            {
                "-transitionName": "Cancel Request",
                "-statusId": "CRQ_PENDING",
                "-statusIdTo": "CRQ_CANCELLED"
            },
            {
                "-transitionName": "Review Request",
                "-statusId": "CRQ_ACCEPTED",
                "-statusIdTo": "CRQ_REVIEWED"
            },
            {
                "-statusId": "CRQ_ACCEPTED",
                "-statusIdTo": "CRQ_COMPLETED",
                "-transitionName": "Complete Request"
            },
            {
                "-statusId": "CRQ_ACCEPTED",
                "-statusIdTo": "CRQ_CANCELLED",
                "-transitionName": "Cancel Request"
            },
            {
                "-statusId": "CRQ_ACCEPTED",
                "-statusIdTo": "CRQ_PENDING",
                "-transitionName": "Pending Customer"
            },
            {
                "-statusId": "CRQ_REVIEWED",
                "-statusIdTo": "CRQ_COMPLETED",
                "-transitionName": "Complete Request"
            },
            {
                "-statusId": "CRQ_REVIEWED",
                "-statusIdTo": "CRQ_CANCELLED",
                "-transitionName": "Cancel Request"
            },
            {
                "-statusId": "CRQ_REVIEWED",
                "-statusIdTo": "CRQ_PENDING",
                "-transitionName": "Pending Customer"
            },
            {
                "-statusId": "CRQ_COMPLETED",
                "-statusIdTo": "CRQ_REVIEWED",
                "-transitionName": "Re-open Request"
            },
            {
                "-transitionName": "Accept Requirement",
                "-statusId": "REQ_PROPOSED",
                "-statusIdTo": "REQ_APPROVED"
            },
            {
                "-statusIdTo": "REQ_REJECTED",
                "-transitionName": "Reject Requirement",
                "-statusId": "REQ_PROPOSED"
            },
            {
                "-statusId": "REQ_CREATED",
                "-statusIdTo": "REQ_APPROVED",
                "-transitionName": "Accept Requirement"
            },
            {
                "-statusId": "REQ_CREATED",
                "-statusIdTo": "REQ_REJECTED",
                "-transitionName": "Reject Requirement"
            },
            {
                "-statusId": "REQ_APPROVED",
                "-statusIdTo": "REQ_ORDERED",
                "-transitionName": "Order Requirement"
            },
            {
                "-statusId": "REQ_APPROVED",
                "-statusIdTo": "REQ_REJECTED",
                "-transitionName": "Reject Requirement"
            },
            {
                "-statusId": "QUO_CREATED",
                "-statusIdTo": "QUO_APPROVED",
                "-transitionName": "Accept Quote"
            },
            {
                "-statusId": "QUO_CREATED",
                "-statusIdTo": "QUO_REJECTED",
                "-transitionName": "Reject Quote"
            },
            {
                "-statusId": "QUO_APPROVED",
                "-statusIdTo": "QUO_ORDERED",
                "-transitionName": "Order Quote"
            },
            {
                "-statusId": "QUO_APPROVED",
                "-statusIdTo": "QUO_REJECTED",
                "-transitionName": "Reject Quote"
            }
        ],
        "ReturnHeaderType": [
            {
                "-description": "Return from Customer",
                "-returnHeaderTypeId": "CUSTOMER_RETURN"
            },
            {
                "-description": "Return to Vendor",
                "-returnHeaderTypeId": "VENDOR_RETURN"
            }
        ],
        "CustRequestType": [
            {
                "-description": "Request For Bug Fix",
                "-hasTable": "N",
                "-parentTypeId": "",
                "-custRequestTypeId": "RF_BUGFIX"
            },
            {
                "-custRequestTypeId": "RF_CATALOG",
                "-description": "Request For Catalog",
                "-hasTable": "N",
                "-parentTypeId": ""
            },
            {
                "-description": "Request For Feature",
                "-hasTable": "N",
                "-parentTypeId": "",
                "-custRequestTypeId": "RF_FEATURE"
            },
            {
                "-custRequestTypeId": "RF_INFO",
                "-description": "Request For Information",
                "-hasTable": "N",
                "-parentTypeId": ""
            },
            {
                "-custRequestTypeId": "RF_PROPOSAL",
                "-description": "Request For Proposal",
                "-hasTable": "N",
                "-parentTypeId": ""
            },
            {
                "-custRequestTypeId": "RF_QUOTE",
                "-description": "Request For Quote",
                "-hasTable": "N",
                "-parentTypeId": ""
            },
            {
                "-custRequestTypeId": "RF_SUPPORT",
                "-description": "Request For Support",
                "-hasTable": "N",
                "-parentTypeId": ""
            },
            {
                "-custRequestTypeId": "RF_PUR_QUOTE",
                "-description": "Request For Purchase Quote",
                "-hasTable": "N",
                "-parentTypeId": ""
            }
        ],
        "OrderAdjustmentType": [
            {
                "-description": "Promotion",
                "-hasTable": "N",
                "-orderAdjustmentTypeId": "PROMOTION_ADJUSTMENT",
                "-parentTypeId": ""
            },
            {
                "-hasTable": "N",
                "-orderAdjustmentTypeId": "REPLACE_ADJUSTMENT",
                "-parentTypeId": "",
                "-description": "Replacement"
            },
            {
                "-description": "Discount",
                "-hasTable": "N",
                "-orderAdjustmentTypeId": "DISCOUNT_ADJUSTMENT",
                "-parentTypeId": ""
            },
            {
                "-hasTable": "N",
                "-orderAdjustmentTypeId": "DONATION_ADJUSTMENT",
                "-parentTypeId": "",
                "-description": "Donation"
            },
            {
                "-parentTypeId": "",
                "-description": "Fee",
                "-hasTable": "N",
                "-orderAdjustmentTypeId": "FEE"
            },
            {
                "-description": "Miscellaneous Charges",
                "-hasTable": "N",
                "-orderAdjustmentTypeId": "MISCELLANEOUS_CHARGE",
                "-parentTypeId": ""
            },
            {
                "-orderAdjustmentTypeId": "SALES_TAX",
                "-parentTypeId": "",
                "-description": "Sales Tax",
                "-hasTable": "N"
            },
            {
                "-description": "VAT Tax (not added to totals)",
                "-hasTable": "N",
                "-orderAdjustmentTypeId": "VAT_TAX",
                "-parentTypeId": ""
            },
            {
                "-description": "VAT Price Correction",
                "-hasTable": "N",
                "-orderAdjustmentTypeId": "VAT_PRICE_CORRECT",
                "-parentTypeId": ""
            },
            {
                "-description": "Shipping and Handling",
                "-hasTable": "N",
                "-orderAdjustmentTypeId": "SHIPPING_CHARGES",
                "-parentTypeId": ""
            },
            {
                "-parentTypeId": "",
                "-description": "Surcharge",
                "-hasTable": "N",
                "-orderAdjustmentTypeId": "SURCHARGE_ADJUSTMENT"
            },
            {
                "-description": "Additional Feature",
                "-hasTable": "N",
                "-orderAdjustmentTypeId": "ADDITIONAL_FEATURE",
                "-parentTypeId": ""
            },
            {
                "-orderAdjustmentTypeId": "WARRANTY_ADJUSTMENT",
                "-parentTypeId": "",
                "-description": "Warranty",
                "-hasTable": "N"
            },
            {
                "-parentTypeId": "",
                "-description": "Marketing Package Adjustment",
                "-hasTable": "N",
                "-orderAdjustmentTypeId": "MKTG_PKG_AUTO_ADJUST"
            }
        ],
        "OrderType": [
            {
                "-description": "Purchase",
                "-hasTable": "N",
                "-orderTypeId": "PURCHASE_ORDER",
                "-parentTypeId": ""
            },
            {
                "-description": "Sales",
                "-hasTable": "N",
                "-orderTypeId": "SALES_ORDER",
                "-parentTypeId": ""
            }
        ],
        "OrderItemAssocType": [
            {
                "-parentTypeId": "",
                "-description": "Purchase Order",
                "-hasTable": "N",
                "-orderItemAssocTypeId": "PURCHASE_ORDER"
            },
            {
                "-description": "Drop Shipment",
                "-hasTable": "N",
                "-orderItemAssocTypeId": "DROP_SHIPMENT",
                "-parentTypeId": ""
            },
            {
                "-description": "Return Replacement",
                "-hasTable": "N",
                "-orderItemAssocTypeId": "REPLACEMENT",
                "-parentTypeId": ""
            },
            {
                "-hasTable": "N",
                "-orderItemAssocTypeId": "NEW_VERSION",
                "-parentTypeId": "",
                "-description": "New Version"
            },
            {
                "-description": "Exchange Order",
                "-hasTable": "N",
                "-orderItemAssocTypeId": "EXCHANGE",
                "-parentTypeId": ""
            }
        ],
        "Enumeration": [
            {
                "-description": "Web Channel",
                "-enumCode": "WEB_CHANNEL",
                "-enumId": "WEB_SALES_CHANNEL",
                "-sequenceId": "01",
                "-enumTypeId": "ORDER_SALES_CHANNEL"
            },
            {
                "-enumId": "FAX_SALES_CHANNEL",
                "-sequenceId": "03",
                "-enumTypeId": "ORDER_SALES_CHANNEL",
                "-description": "Fax Channel",
                "-enumCode": "FAX_CHANNEL"
            },
            {
                "-description": "Phone Channel",
                "-enumCode": "PHONE_CHANNEL",
                "-enumId": "PHONE_SALES_CHANNEL",
                "-sequenceId": "04",
                "-enumTypeId": "ORDER_SALES_CHANNEL"
            },
            {
                "-description": "E-Mail Channel",
                "-enumCode": "EMAIL_CHANNEL",
                "-enumId": "EMAIL_SALES_CHANNEL",
                "-sequenceId": "05",
                "-enumTypeId": "ORDER_SALES_CHANNEL"
            },
            {
                "-description": "Snail Mail Channel",
                "-enumCode": "SNAIL_CHANNEL",
                "-enumId": "SNAIL_SALES_CHANNEL",
                "-sequenceId": "06",
                "-enumTypeId": "ORDER_SALES_CHANNEL"
            },
            {
                "-enumTypeId": "ORDER_SALES_CHANNEL",
                "-description": "Affiliate Channel",
                "-enumCode": "AFFIL_CHANNEL",
                "-enumId": "AFFIL_SALES_CHANNEL",
                "-sequenceId": "07"
            },
            {
                "-sequenceId": "08",
                "-enumTypeId": "ORDER_SALES_CHANNEL",
                "-description": "eBay Channel",
                "-enumCode": "EBAY_CHANNEL",
                "-enumId": "EBAY_SALES_CHANNEL"
            },
            {
                "-description": "Unknown Channel",
                "-enumCode": "UNKOWN_CHANNEL",
                "-enumId": "UNKNWN_SALES_CHANNEL",
                "-sequenceId": "99",
                "-enumTypeId": "ORDER_SALES_CHANNEL"
            },
            {
                "-description": "Order Item Update",
                "-enumCode": "ITM_UPDATE",
                "-enumId": "ODR_ITM_UPDATE",
                "-sequenceId": "01",
                "-enumTypeId": "ODR_ITM_CHANGE_TYPE"
            },
            {
                "-description": "Order Item Cancel",
                "-enumCode": "ITM_CANCEL",
                "-enumId": "ODR_ITM_CANCEL",
                "-sequenceId": "02",
                "-enumTypeId": "ODR_ITM_CHANGE_TYPE"
            },
            {
                "-enumId": "ODR_ITM_APPEND",
                "-sequenceId": "03",
                "-enumTypeId": "ODR_ITM_CHANGE_TYPE",
                "-description": "Order Item Append",
                "-enumCode": "ITM_APPEND"
            },
            {
                "-enumCode": "MISORDER",
                "-enumId": "OICR_MISORDER_ITEM",
                "-sequenceId": "01",
                "-enumTypeId": "ODR_ITM_CH_REASON",
                "-description": "Mis-Ordered Item"
            },
            {
                "-enumId": "OICR_CHANGE_MIND",
                "-sequenceId": "02",
                "-enumTypeId": "ODR_ITM_CH_REASON",
                "-description": "Changed Mind",
                "-enumCode": "CHANGE_MIND"
            }
        ],
        "ReturnReason": [
            {
                "-sequenceId": "01",
                "-returnReasonId": "RTN_NOT_WANT",
                "-description": "Did Not Want Item"
            },
            {
                "-sequenceId": "02",
                "-returnReasonId": "RTN_DEFECTIVE_ITEM",
                "-description": "Defective Item"
            },
            {
                "-sequenceId": "03",
                "-returnReasonId": "RTN_MISSHIP_ITEM",
                "-description": "Mis-Shipped Item"
            },
            {
                "-sequenceId": "04",
                "-returnReasonId": "RTN_DIG_FILL_FAIL",
                "-description": "Digital Fulfillment Failed"
            },
            {
                "-description": "COD Payment Rejected",
                "-sequenceId": "05",
                "-returnReasonId": "RTN_COD_REJECT"
            },
            {
                "-returnReasonId": "RTN_SIZE_EXCHANGE",
                "-description": "Size Exchange",
                "-sequenceId": "06"
            },
            {
                "-sequenceId": "07",
                "-returnReasonId": "RTN_NORMAL_RETURN",
                "-description": "Normal Return"
            }
        ],
        "ReturnItemTypeMap": [
            {
                "-returnHeaderTypeId": "CUSTOMER_RETURN",
                "-returnItemMapKey": "FINISHED_GOOD",
                "-returnItemTypeId": "RET_FPROD_ITEM"
            },
            {
                "-returnHeaderTypeId": "CUSTOMER_RETURN",
                "-returnItemMapKey": "MARKETING_PKG_AUTO",
                "-returnItemTypeId": "RET_FPROD_ITEM"
            },
            {
                "-returnHeaderTypeId": "CUSTOMER_RETURN",
                "-returnItemMapKey": "MARKETING_PKG_PICK",
                "-returnItemTypeId": "RET_FPROD_ITEM"
            },
            {
                "-returnItemTypeId": "RET_FPROD_ITEM",
                "-returnHeaderTypeId": "CUSTOMER_RETURN",
                "-returnItemMapKey": "AGGREGATED_CONF"
            },
            {
                "-returnHeaderTypeId": "CUSTOMER_RETURN",
                "-returnItemMapKey": "DIGITAL_GOOD",
                "-returnItemTypeId": "RET_DPROD_ITEM"
            },
            {
                "-returnItemTypeId": "RET_FDPROD_ITEM",
                "-returnHeaderTypeId": "CUSTOMER_RETURN",
                "-returnItemMapKey": "FINDIG_GOOD"
            },
            {
                "-returnItemMapKey": "RAW_MATERIAL",
                "-returnItemTypeId": "RET_RPROD_ITEM",
                "-returnHeaderTypeId": "CUSTOMER_RETURN"
            },
            {
                "-returnHeaderTypeId": "CUSTOMER_RETURN",
                "-returnItemMapKey": "PROMOTION_ADJUSTMENT",
                "-returnItemTypeId": "RET_PROMOTION_ADJ"
            },
            {
                "-returnHeaderTypeId": "CUSTOMER_RETURN",
                "-returnItemMapKey": "REPLACE_ADJUSTMENT",
                "-returnItemTypeId": "RET_REPLACE_ADJ"
            },
            {
                "-returnHeaderTypeId": "CUSTOMER_RETURN",
                "-returnItemMapKey": "DISCOUNT_ADJUSTMENT",
                "-returnItemTypeId": "RET_DISCOUNT_ADJ"
            },
            {
                "-returnHeaderTypeId": "CUSTOMER_RETURN",
                "-returnItemMapKey": "FEE",
                "-returnItemTypeId": "RET_FEE_ADJ"
            },
            {
                "-returnHeaderTypeId": "CUSTOMER_RETURN",
                "-returnItemMapKey": "MISCELLANEOUS_CHARGE",
                "-returnItemTypeId": "RET_MISC_ADJ"
            },
            {
                "-returnHeaderTypeId": "CUSTOMER_RETURN",
                "-returnItemMapKey": "SALES_TAX",
                "-returnItemTypeId": "RET_SALES_TAX_ADJ"
            },
            {
                "-returnItemTypeId": "RET_VAT_TAX_ADJ",
                "-returnHeaderTypeId": "CUSTOMER_RETURN",
                "-returnItemMapKey": "VAT_TAX"
            },
            {
                "-returnHeaderTypeId": "CUSTOMER_RETURN",
                "-returnItemMapKey": "VAT_PRICE_CORRECT",
                "-returnItemTypeId": "RET_VAT_PC_ADJ"
            },
            {
                "-returnHeaderTypeId": "CUSTOMER_RETURN",
                "-returnItemMapKey": "SHIPPING_CHARGES",
                "-returnItemTypeId": "RET_SHIPPING_ADJ"
            },
            {
                "-returnHeaderTypeId": "CUSTOMER_RETURN",
                "-returnItemMapKey": "SURCHARGE_ADJUSTMENT",
                "-returnItemTypeId": "RET_SURCHARGE_ADJ"
            },
            {
                "-returnHeaderTypeId": "CUSTOMER_RETURN",
                "-returnItemMapKey": "ADDITIONAL_FEATURE",
                "-returnItemTypeId": "RET_ADD_FEATURE_ADJ"
            },
            {
                "-returnHeaderTypeId": "CUSTOMER_RETURN",
                "-returnItemMapKey": "WARRANTY_ADJUSTMENT",
                "-returnItemTypeId": "RET_WARRANTY_ADJ"
            },
            {
                "-returnHeaderTypeId": "CUSTOMER_RETURN",
                "-returnItemMapKey": "RENTAL_ORDER_ITEM",
                "-returnItemTypeId": "RET_FPROD_ITEM"
            },
            {
                "-returnHeaderTypeId": "CUSTOMER_RETURN",
                "-returnItemMapKey": "ASSET_USAGE_OUT_IN",
                "-returnItemTypeId": "RET_FPROD_ITEM"
            },
            {
                "-returnHeaderTypeId": "CUSTOMER_RETURN",
                "-returnItemMapKey": "SERVICE_PRODUCT",
                "-returnItemTypeId": "RET_SPROD_ITEM"
            },
            {
                "-returnHeaderTypeId": "CUSTOMER_RETURN",
                "-returnItemMapKey": "SERVICE",
                "-returnItemTypeId": "RET_SPROD_ITEM"
            },
            {
                "-returnItemMapKey": "RAW_MATERIAL",
                "-returnItemTypeId": "RET_MPROD_ITEM",
                "-returnHeaderTypeId": "CUSTOMER_RETURN"
            },
            {
                "-returnHeaderTypeId": "VENDOR_RETURN",
                "-returnItemMapKey": "FINISHED_GOOD",
                "-returnItemTypeId": "RET_FPROD_ITEM"
            },
            {
                "-returnHeaderTypeId": "VENDOR_RETURN",
                "-returnItemMapKey": "MARKETING_PKG_AUTO",
                "-returnItemTypeId": "RET_FPROD_ITEM"
            },
            {
                "-returnHeaderTypeId": "VENDOR_RETURN",
                "-returnItemMapKey": "MARKETING_PKG_PICK",
                "-returnItemTypeId": "RET_FPROD_ITEM"
            },
            {
                "-returnHeaderTypeId": "VENDOR_RETURN",
                "-returnItemMapKey": "AGGREGATED_CONF",
                "-returnItemTypeId": "RET_FPROD_ITEM"
            },
            {
                "-returnHeaderTypeId": "VENDOR_RETURN",
                "-returnItemMapKey": "DIGITAL_GOOD",
                "-returnItemTypeId": "RET_DPROD_ITEM"
            },
            {
                "-returnHeaderTypeId": "VENDOR_RETURN",
                "-returnItemMapKey": "FINDIG_GOOD",
                "-returnItemTypeId": "RET_FDPROD_ITEM"
            },
            {
                "-returnHeaderTypeId": "VENDOR_RETURN",
                "-returnItemMapKey": "RAW_MATERIAL",
                "-returnItemTypeId": "RET_RPROD_ITEM"
            },
            {
                "-returnHeaderTypeId": "VENDOR_RETURN",
                "-returnItemMapKey": "PROMOTION_ADJUSTMENT",
                "-returnItemTypeId": "RET_PROMOTION_ADJ"
            },
            {
                "-returnItemTypeId": "RET_REPLACE_ADJ",
                "-returnHeaderTypeId": "VENDOR_RETURN",
                "-returnItemMapKey": "REPLACE_ADJUSTMENT"
            },
            {
                "-returnHeaderTypeId": "VENDOR_RETURN",
                "-returnItemMapKey": "DISCOUNT_ADJUSTMENT",
                "-returnItemTypeId": "RET_DISCOUNT_ADJ"
            },
            {
                "-returnHeaderTypeId": "VENDOR_RETURN",
                "-returnItemMapKey": "FEE",
                "-returnItemTypeId": "RET_FEE_ADJ"
            },
            {
                "-returnHeaderTypeId": "VENDOR_RETURN",
                "-returnItemMapKey": "MISCELLANEOUS_CHARGE",
                "-returnItemTypeId": "RET_MISC_ADJ"
            },
            {
                "-returnHeaderTypeId": "VENDOR_RETURN",
                "-returnItemMapKey": "SALES_TAX",
                "-returnItemTypeId": "RET_SALES_TAX_ADJ"
            },
            {
                "-returnHeaderTypeId": "VENDOR_RETURN",
                "-returnItemMapKey": "VAT_TAX",
                "-returnItemTypeId": "RET_VAT_TAX_ADJ"
            },
            {
                "-returnHeaderTypeId": "VENDOR_RETURN",
                "-returnItemMapKey": "VAT_PRICE_CORRECT",
                "-returnItemTypeId": "RET_VAT_PC_ADJ"
            },
            {
                "-returnHeaderTypeId": "VENDOR_RETURN",
                "-returnItemMapKey": "SHIPPING_CHARGES",
                "-returnItemTypeId": "RET_SHIPPING_ADJ"
            },
            {
                "-returnHeaderTypeId": "VENDOR_RETURN",
                "-returnItemMapKey": "SURCHARGE_ADJUSTMENT",
                "-returnItemTypeId": "RET_SURCHARGE_ADJ"
            },
            {
                "-returnHeaderTypeId": "VENDOR_RETURN",
                "-returnItemMapKey": "ADDITIONAL_FEATURE",
                "-returnItemTypeId": "RET_ADD_FEATURE_ADJ"
            },
            {
                "-returnItemMapKey": "WARRANTY_ADJUSTMENT",
                "-returnItemTypeId": "RET_WARRANTY_ADJ",
                "-returnHeaderTypeId": "VENDOR_RETURN"
            },
            {
                "-returnItemTypeId": "RET_MPROD_ITEM",
                "-returnHeaderTypeId": "VENDOR_RETURN",
                "-returnItemMapKey": "RAW_MATERIAL"
            }
        ],
        "ReturnType": [
            {
                "-sequenceId": "01",
                "-returnTypeId": "RTN_CREDIT",
                "-description": "Store Credit"
            },
            {
                "-description": "Refund",
                "-sequenceId": "02",
                "-returnTypeId": "RTN_REFUND"
            },
            {
                "-sequenceId": "03",
                "-returnTypeId": "RTN_REPLACE",
                "-description": "Wait Replacement"
            },
            {
                "-returnTypeId": "RTN_CSREPLACE",
                "-description": "Cross-Ship Replacement",
                "-sequenceId": "04"
            },
            {
                "-sequenceId": "05",
                "-returnTypeId": "RTN_REPAIR_REPLACE",
                "-description": "Repair Replacement"
            },
            {
                "-sequenceId": "06",
                "-returnTypeId": "RTN_WAIT_REPLACE_RES",
                "-description": "Wait Replacement Reserved"
            },
            {
                "-sequenceId": "07",
                "-returnTypeId": "RTN_REPLACE_IMMEDIAT",
                "-description": "Replace Immediately"
            },
            {
                "-sequenceId": "08",
                "-returnTypeId": "RTN_REFUND_IMMEDIATE",
                "-description": "Refund immediately"
            },
            {
                "-sequenceId": "09",
                "-returnTypeId": "RTN_RENTAL",
                "-description": "Rental"
            }
        ],
        "WorkReqFulfType": [
            {
                "-description": "Implements",
                "-workReqFulfTypeId": "WRF_IMPLEMENTS"
            },
            {
                "-workReqFulfTypeId": "WRF_FIXES",
                "-description": "Fixes"
            },
            {
                "-description": "Deploys",
                "-workReqFulfTypeId": "WRF_DEPLOYS"
            },
            {
                "-description": "Tests",
                "-workReqFulfTypeId": "WRF_TESTS"
            },
            {
                "-description": "Delivers",
                "-workReqFulfTypeId": "WRF_DELIVERS"
            }
        ],
        "OrderBlacklistType": [
            {
                "-orderBlacklistTypeId": "BLACKLIST_ADDRESS",
                "-description": "Addresss"
            },
            {
                "-orderBlacklistTypeId": "BLACKLIST_CREDITCARD",
                "-description": "Credit Card"
            },
            {
                "-orderBlacklistTypeId": "BLACKLIST_EMAIL",
                "-description": "E-Mail"
            },
            {
                "-orderBlacklistTypeId": "BLACKLIST_PHONE",
                "-description": "Phone Number"
            }
        ],
        "RequirementType": [
            {
                "-requirementTypeId": "CUSTOMER_REQUIREMENT",
                "-description": "Customer Requirement",
                "-hasTable": "N",
                "-parentTypeId": ""
            },
            {
                "-hasTable": "N",
                "-parentTypeId": "",
                "-requirementTypeId": "INTERNAL_REQUIREMENT",
                "-description": "Internal Requirement"
            },
            {
                "-requirementTypeId": "PRODUCT_REQUIREMENT",
                "-description": "Product Requirement",
                "-hasTable": "N",
                "-parentTypeId": ""
            },
            {
                "-requirementTypeId": "WORK_REQUIREMENT",
                "-description": "Work Requirement",
                "-hasTable": "N",
                "-parentTypeId": ""
            }
        ],
        "ShoppingListType": [
            {
                "-description": "Wish List",
                "-shoppingListTypeId": "SLT_WISH_LIST"
            },
            {
                "-description": "Gift Registry",
                "-shoppingListTypeId": "SLT_GIFT_REG"
            },
            {
                "-description": "Automatic Re-Orders",
                "-shoppingListTypeId": "SLT_AUTO_REODR"
            },
            {
                "-description": "Frequent Purchases",
                "-shoppingListTypeId": "SLT_FREQ_PURCHASES"
            },
            {
                "-description": "Special Purpose",
                "-shoppingListTypeId": "SLT_SPEC_PURP"
            }
        ],
        "StatusType": [
            {
                "-statusTypeId": "ORDER_STATUS",
                "-description": "Order",
                "-hasTable": "N",
                "-parentTypeId": ""
            },
            {
                "-description": "Order Item",
                "-hasTable": "N",
                "-parentTypeId": "ORDER_STATUS",
                "-statusTypeId": "ORDER_ITEM_STATUS"
            },
            {
                "-description": "Payment Preference",
                "-hasTable": "N",
                "-parentTypeId": "",
                "-statusTypeId": "PAYMENT_PREF_STATUS"
            },
            {
                "-description": "Order Delivery Schedule",
                "-hasTable": "N",
                "-parentTypeId": "",
                "-statusTypeId": "ORDER_DEL_SCH"
            },
            {
                "-description": "Order Return Status For Customer Returns",
                "-hasTable": "N",
                "-parentTypeId": "",
                "-statusTypeId": "ORDER_RETURN_STTS"
            },
            {
                "-description": "Order Return Status For Supplier Returns",
                "-hasTable": "N",
                "-parentTypeId": "",
                "-statusTypeId": "PORDER_RETURN_STTS"
            },
            {
                "-description": "Custom Request Status",
                "-hasTable": "N",
                "-parentTypeId": "",
                "-statusTypeId": "CUSTREQ_STTS"
            },
            {
                "-description": "Requirement Status",
                "-hasTable": "N",
                "-parentTypeId": "",
                "-statusTypeId": "REQUIREMENT_STATUS"
            },
            {
                "-description": "Quote Status",
                "-hasTable": "N",
                "-parentTypeId": "",
                "-statusTypeId": "QUOTE_STATUS"
            }
        ],
        "ReturnItemType": [
            {
                "-description": "Return Non-Product Item",
                "-returnItemTypeId": "RET_NPROD_ITEM",
                "-parentTypeId": ""
            },
            {
                "-description": "Return Product Item",
                "-returnItemTypeId": "RET_PROD_ITEM",
                "-parentTypeId": ""
            },
            {
                "-description": "Return Finished Good Item",
                "-returnItemTypeId": "RET_FPROD_ITEM",
                "-parentTypeId": "RET_PROD_ITEM"
            },
            {
                "-description": "Return Digital Good Item",
                "-returnItemTypeId": "RET_DPROD_ITEM",
                "-parentTypeId": "RET_PROD_ITEM"
            },
            {
                "-description": "Return Finished/Digital Good Item",
                "-returnItemTypeId": "RET_FDPROD_ITEM",
                "-parentTypeId": "RET_PROD_ITEM"
            },
            {
                "-description": "Return Raw Material Good Item",
                "-returnItemTypeId": "RET_RPROD_ITEM",
                "-parentTypeId": "RET_PROD_ITEM"
            },
            {
                "-description": "Return Product-Feature Item",
                "-returnItemTypeId": "RET_PROD_FEATR_ITEM",
                "-parentTypeId": "RET_PROD_ITEM"
            },
            {
                "-description": "Return Service Product Item",
                "-returnItemTypeId": "RET_SPROD_ITEM",
                "-parentTypeId": "RET_PROD_ITEM"
            },
            {
                "-description": "Return Work-Effort Item",
                "-returnItemTypeId": "RET_WE_ITEM",
                "-parentTypeId": "RET_NPROD_ITEM"
            },
            {
                "-returnItemTypeId": "RET_TE_ITEM",
                "-parentTypeId": "RET_NPROD_ITEM",
                "-description": "Return Time-Entry Item"
            },
            {
                "-description": "Return Raw Material Item",
                "-returnItemTypeId": "RET_MPROD_ITEM",
                "-parentTypeId": "RET_PROD_ITEM"
            }
        ]
    }
}