{
    "entity-engine-xml": {
        "EntityGroup": [
            {
                "-entityGroupName": "Top Level: Common",
                "-entityGroupId": "5000"
            },
            {
                "-entityGroupId": "5010",
                "-entityGroupName": "Top Level: Content"
            },
            {
                "-entityGroupName": "Top Level: Party",
                "-entityGroupId": "5020"
            },
            {
                "-entityGroupId": "5030",
                "-entityGroupName": "Top Level: Product"
            },
            {
                "-entityGroupId": "5035",
                "-entityGroupName": "Top Level: Facility"
            },
            {
                "-entityGroupId": "5040",
                "-entityGroupName": "Top Level: Order"
            },
            {
                "-entityGroupName": "Top Level: Accounting",
                "-entityGroupId": "5050"
            },
            {
                "-entityGroupId": "5060",
                "-entityGroupName": "Top Level: WorkEffort"
            },
            {
                "-entityGroupId": "6000",
                "-entityGroupName": "Detail: Example and Common"
            },
            {
                "-entityGroupName": "Detail: Common Entities",
                "-entityGroupId": "6050"
            },
            {
                "-entityGroupId": "6100",
                "-entityGroupName": "Detail Content: Content"
            },
            {
                "-entityGroupId": "6110",
                "-entityGroupName": "Detail Content: Survey"
            },
            {
                "-entityGroupId": "6120",
                "-entityGroupName": "Detail Content: Other"
            },
            {
                "-entityGroupId": "6200",
                "-entityGroupName": "Detail Party: Party"
            },
            {
                "-entityGroupName": "Detail Party: Contact",
                "-entityGroupId": "6210"
            },
            {
                "-entityGroupId": "6220",
                "-entityGroupName": "Detail Party: Communication"
            },
            {
                "-entityGroupId": "6230",
                "-entityGroupName": "Detail Party: Agreement and Need"
            },
            {
                "-entityGroupId": "6300",
                "-entityGroupName": "Detail Product: Product"
            },
            {
                "-entityGroupId": "6310",
                "-entityGroupName": "Detail Product: Catalog and Category"
            },
            {
                "-entityGroupId": "6320",
                "-entityGroupName": "Detail Product: Store"
            },
            {
                "-entityGroupId": "6330",
                "-entityGroupName": "Detail Product: Config"
            },
            {
                "-entityGroupId": "6340",
                "-entityGroupName": "Detail Product: Price, Promo, and Cost"
            },
            {
                "-entityGroupId": "6350",
                "-entityGroupName": "Detail Product: Facility"
            },
            {
                "-entityGroupId": "6360",
                "-entityGroupName": "Detail Product: Feature"
            },
            {
                "-entityGroupId": "6370",
                "-entityGroupName": "Detail Product: Inventory"
            },
            {
                "-entityGroupId": "6380",
                "-entityGroupName": "Detail Product: Subscription"
            },
            {
                "-entityGroupId": "6390",
                "-entityGroupName": "Detail Product: Shipment"
            },
            {
                "-entityGroupName": "Detail Order: Order",
                "-entityGroupId": "6400"
            },
            {
                "-entityGroupName": "Detail Order: Request",
                "-entityGroupId": "6410"
            },
            {
                "-entityGroupId": "6420",
                "-entityGroupName": "Detail Order: Requirement"
            },
            {
                "-entityGroupId": "6430",
                "-entityGroupName": "Detail Order: Quote"
            },
            {
                "-entityGroupId": "6440",
                "-entityGroupName": "Detail Order: Return"
            },
            {
                "-entityGroupId": "6450",
                "-entityGroupName": "Detail Order: Opportunity, Shopping List, Shopping Cart"
            },
            {
                "-entityGroupId": "6500",
                "-entityGroupName": "Detail Accounting: Ledger"
            },
            {
                "-entityGroupId": "6510",
                "-entityGroupName": "Detail Accounting: Budget"
            },
            {
                "-entityGroupId": "6520",
                "-entityGroupName": "Detail Accounting: Financial Account"
            },
            {
                "-entityGroupId": "6530",
                "-entityGroupName": "Detail Accounting: Invoice"
            },
            {
                "-entityGroupId": "6540",
                "-entityGroupName": "Detail Accounting: Payment"
            },
            {
                "-entityGroupId": "6550",
                "-entityGroupName": "Detail Accounting: Tax"
            },
            {
                "-entityGroupId": "6560",
                "-entityGroupName": "Detail Accounting: Fixed Asset"
            },
            {
                "-entityGroupId": "6600",
                "-entityGroupName": "Detail Work Effort"
            },
            {
                "-entityGroupId": "6710",
                "-entityGroupName": "Detail Manufacturing"
            },
            {
                "-entityGroupId": "6720",
                "-entityGroupName": "Detail Human Resources"
            },
            {
                "-entityGroupName": "Detail Marketing",
                "-entityGroupId": "6730"
            },
            {
                "-entityGroupId": "6800",
                "-entityGroupName": "OLAP/BI General"
            },
            {
                "-entityGroupId": "6910",
                "-entityGroupName": "Technical: Entity and Service"
            },
            {
                "-entityGroupId": "6920",
                "-entityGroupName": "Technical: Web"
            },
            {
                "-entityGroupId": "6930",
                "-entityGroupName": "Technical: Login and Security"
            },
            {
                "-entityGroupId": "6990",
                "-entityGroupName": "Technical: WebPOS, OAGIS, Other"
            }
        ],
        "EntityGroupEntry": [
            {
                "-entityGroupId": "5000",
                "-entityOrPackage": "DataSource",
                "-applEnumId": "ESIA_INCLUDE"
            },
            {
                "-entityGroupId": "5000",
                "-entityOrPackage": "Geo",
                "-applEnumId": "ESIA_INCLUDE"
            },
            {
                "-applEnumId": "ESIA_INCLUDE",
                "-entityGroupId": "5000",
                "-entityOrPackage": "GeoAssoc"
            },
            {
                "-entityGroupId": "5000",
                "-entityOrPackage": "NoteData",
                "-applEnumId": "ESIA_INCLUDE"
            },
            {
                "-entityOrPackage": "CustomTimePeriod",
                "-applEnumId": "ESIA_INCLUDE",
                "-entityGroupId": "5000"
            },
            {
                "-entityGroupId": "5000",
                "-entityOrPackage": "StatusItem",
                "-applEnumId": "ESIA_INCLUDE"
            },
            {
                "-entityGroupId": "5000",
                "-entityOrPackage": "StatusValidChange",
                "-applEnumId": "ESIA_INCLUDE"
            },
            {
                "-entityGroupId": "5000",
                "-entityOrPackage": "Uom",
                "-applEnumId": "ESIA_INCLUDE"
            },
            {
                "-entityGroupId": "5000",
                "-entityOrPackage": "UomConversionDated",
                "-applEnumId": "ESIA_INCLUDE"
            },
            {
                "-entityGroupId": "5000",
                "-entityOrPackage": "UserPreference",
                "-applEnumId": "ESIA_INCLUDE"
            },
            {
                "-entityGroupId": "5010",
                "-entityOrPackage": "Content",
                "-applEnumId": "ESIA_INCLUDE"
            },
            {
                "-entityOrPackage": "ContentAssoc",
                "-applEnumId": "ESIA_INCLUDE",
                "-entityGroupId": "5010"
            },
            {
                "-entityGroupId": "5010",
                "-entityOrPackage": "DataResource",
                "-applEnumId": "ESIA_INCLUDE"
            },
            {
                "-entityOrPackage": "Survey",
                "-applEnumId": "ESIA_INCLUDE",
                "-entityGroupId": "5010"
            },
            {
                "-entityGroupId": "5010",
                "-entityOrPackage": "WebSiteContent",
                "-applEnumId": "ESIA_INCLUDE"
            },
            {
                "-entityGroupId": "5010",
                "-entityOrPackage": "WebSite",
                "-applEnumId": "ESIA_INCLUDE"
            },
            {
                "-entityOrPackage": "Party",
                "-applEnumId": "ESIA_INCLUDE",
                "-entityGroupId": "5020"
            },
            {
                "-entityGroupId": "5020",
                "-entityOrPackage": "Person",
                "-applEnumId": "ESIA_INCLUDE"
            },
            {
                "-entityGroupId": "5020",
                "-entityOrPackage": "PartyGroup",
                "-applEnumId": "ESIA_INCLUDE"
            },
            {
                "-applEnumId": "ESIA_INCLUDE",
                "-entityGroupId": "5020",
                "-entityOrPackage": "PartyRole"
            },
            {
                "-applEnumId": "ESIA_INCLUDE",
                "-entityGroupId": "5020",
                "-entityOrPackage": "RoleType"
            },
            {
                "-entityGroupId": "5020",
                "-entityOrPackage": "PartyContactMech",
                "-applEnumId": "ESIA_INCLUDE"
            },
            {
                "-entityGroupId": "5020",
                "-entityOrPackage": "ContactMech",
                "-applEnumId": "ESIA_INCLUDE"
            },
            {
                "-entityGroupId": "5020",
                "-entityOrPackage": "CommunicationEvent",
                "-applEnumId": "ESIA_INCLUDE"
            },
            {
                "-entityGroupId": "5020",
                "-entityOrPackage": "Agreement",
                "-applEnumId": "ESIA_INCLUDE"
            },
            {
                "-entityGroupId": "5020",
                "-entityOrPackage": "UserLogin",
                "-applEnumId": "ESIA_INCLUDE"
            },
            {
                "-entityGroupId": "5020",
                "-entityOrPackage": "UserLoginSecurityGroup",
                "-applEnumId": "ESIA_INCLUDE"
            },
            {
                "-entityGroupId": "5020",
                "-entityOrPackage": "SecurityGroup",
                "-applEnumId": "ESIA_INCLUDE"
            },
            {
                "-entityGroupId": "5020",
                "-entityOrPackage": "SecurityGroupPermission",
                "-applEnumId": "ESIA_INCLUDE"
            },
            {
                "-entityGroupId": "5020",
                "-entityOrPackage": "SecurityPermission",
                "-applEnumId": "ESIA_INCLUDE"
            },
            {
                "-entityGroupId": "5030",
                "-entityOrPackage": "ProductStore",
                "-applEnumId": "ESIA_INCLUDE"
            },
            {
                "-entityGroupId": "5030",
                "-entityOrPackage": "ProductStoreCatalog",
                "-applEnumId": "ESIA_INCLUDE"
            },
            {
                "-entityGroupId": "5030",
                "-entityOrPackage": "ProdCatalog",
                "-applEnumId": "ESIA_INCLUDE"
            },
            {
                "-entityOrPackage": "ProdCatalogCategory",
                "-applEnumId": "ESIA_INCLUDE",
                "-entityGroupId": "5030"
            },
            {
                "-entityGroupId": "5030",
                "-entityOrPackage": "ProductCategory",
                "-applEnumId": "ESIA_INCLUDE"
            },
            {
                "-entityGroupId": "5030",
                "-entityOrPackage": "ProductCategoryMember",
                "-applEnumId": "ESIA_INCLUDE"
            },
            {
                "-entityGroupId": "5030",
                "-entityOrPackage": "Product",
                "-applEnumId": "ESIA_INCLUDE"
            },
            {
                "-applEnumId": "ESIA_INCLUDE",
                "-entityGroupId": "5030",
                "-entityOrPackage": "ProductStorePromoAppl"
            },
            {
                "-entityGroupId": "5030",
                "-entityOrPackage": "ProductPromo",
                "-applEnumId": "ESIA_INCLUDE"
            },
            {
                "-entityGroupId": "5035",
                "-entityOrPackage": "Facility",
                "-applEnumId": "ESIA_INCLUDE"
            },
            {
                "-entityGroupId": "5035",
                "-entityOrPackage": "FacilityLocation",
                "-applEnumId": "ESIA_INCLUDE"
            },
            {
                "-entityGroupId": "5035",
                "-entityOrPackage": "InventoryItem",
                "-applEnumId": "ESIA_INCLUDE"
            },
            {
                "-entityOrPackage": "InventoryItemDetail",
                "-applEnumId": "ESIA_INCLUDE",
                "-entityGroupId": "5035"
            },
            {
                "-entityGroupId": "5035",
                "-entityOrPackage": "Shipment",
                "-applEnumId": "ESIA_INCLUDE"
            },
            {
                "-entityGroupId": "5035",
                "-entityOrPackage": "ShipmentItem",
                "-applEnumId": "ESIA_INCLUDE"
            },
            {
                "-entityGroupId": "5035",
                "-entityOrPackage": "ItemIssuance",
                "-applEnumId": "ESIA_INCLUDE"
            },
            {
                "-entityGroupId": "5040",
                "-entityOrPackage": "CustRequest",
                "-applEnumId": "ESIA_INCLUDE"
            },
            {
                "-entityGroupId": "5040",
                "-entityOrPackage": "CustRequestItem",
                "-applEnumId": "ESIA_INCLUDE"
            },
            {
                "-entityGroupId": "5040",
                "-entityOrPackage": "RequirementCustRequest",
                "-applEnumId": "ESIA_INCLUDE"
            },
            {
                "-applEnumId": "ESIA_INCLUDE",
                "-entityGroupId": "5040",
                "-entityOrPackage": "Requirement"
            },
            {
                "-entityOrPackage": "Quote",
                "-applEnumId": "ESIA_INCLUDE",
                "-entityGroupId": "5040"
            },
            {
                "-applEnumId": "ESIA_INCLUDE",
                "-entityGroupId": "5040",
                "-entityOrPackage": "QuoteItem"
            },
            {
                "-entityGroupId": "5040",
                "-entityOrPackage": "OrderHeader",
                "-applEnumId": "ESIA_INCLUDE"
            },
            {
                "-entityGroupId": "5040",
                "-entityOrPackage": "OrderItem",
                "-applEnumId": "ESIA_INCLUDE"
            },
            {
                "-entityGroupId": "5040",
                "-entityOrPackage": "ReturnHeader",
                "-applEnumId": "ESIA_INCLUDE"
            },
            {
                "-entityGroupId": "5050",
                "-entityOrPackage": "Invoice",
                "-applEnumId": "ESIA_INCLUDE"
            },
            {
                "-entityGroupId": "5050",
                "-entityOrPackage": "PaymentApplication",
                "-applEnumId": "ESIA_INCLUDE"
            },
            {
                "-entityGroupId": "5050",
                "-entityOrPackage": "Payment",
                "-applEnumId": "ESIA_INCLUDE"
            },
            {
                "-applEnumId": "ESIA_INCLUDE",
                "-entityGroupId": "5050",
                "-entityOrPackage": "BillingAccount"
            },
            {
                "-entityGroupId": "5050",
                "-entityOrPackage": "FinAccount",
                "-applEnumId": "ESIA_INCLUDE"
            },
            {
                "-applEnumId": "ESIA_INCLUDE",
                "-entityGroupId": "5050",
                "-entityOrPackage": "TaxAuthority"
            },
            {
                "-applEnumId": "ESIA_INCLUDE",
                "-entityGroupId": "5050",
                "-entityOrPackage": "Budget"
            },
            {
                "-applEnumId": "ESIA_INCLUDE",
                "-entityGroupId": "5050",
                "-entityOrPackage": "GlAccount"
            },
            {
                "-entityOrPackage": "AcctgTrans",
                "-applEnumId": "ESIA_INCLUDE",
                "-entityGroupId": "5050"
            },
            {
                "-applEnumId": "ESIA_INCLUDE",
                "-entityGroupId": "5050",
                "-entityOrPackage": "AcctgTransEntry"
            },
            {
                "-entityGroupId": "5050",
                "-entityOrPackage": "FixedAsset",
                "-applEnumId": "ESIA_INCLUDE"
            },
            {
                "-entityOrPackage": "WorkEffort",
                "-applEnumId": "ESIA_INCLUDE",
                "-entityGroupId": "5060"
            },
            {
                "-entityGroupId": "5060",
                "-entityOrPackage": "WorkEffortAssoc",
                "-applEnumId": "ESIA_INCLUDE"
            },
            {
                "-applEnumId": "ESIA_INCLUDE",
                "-entityGroupId": "5060",
                "-entityOrPackage": "TimeEntry"
            },
            {
                "-entityGroupId": "5060",
                "-entityOrPackage": "Timesheet",
                "-applEnumId": "ESIA_INCLUDE"
            },
            {
                "-entityGroupId": "5060",
                "-entityOrPackage": "CustRequestItem",
                "-applEnumId": "ESIA_INCLUDE"
            },
            {
                "-entityGroupId": "5060",
                "-entityOrPackage": "CustRequestItemWorkEffort",
                "-applEnumId": "ESIA_INCLUDE"
            },
            {
                "-entityGroupId": "5060",
                "-entityOrPackage": "Requirement",
                "-applEnumId": "ESIA_INCLUDE"
            },
            {
                "-entityGroupId": "5060",
                "-entityOrPackage": "WorkRequirementFulfillment",
                "-applEnumId": "ESIA_INCLUDE"
            },
            {
                "-entityOrPackage": "org.apache.ofbiz.example",
                "-applEnumId": "ESIA_INCLUDE",
                "-entityGroupId": "6000"
            },
            {
                "-entityGroupId": "6000",
                "-entityOrPackage": "Uom",
                "-applEnumId": "ESIA_INCLUDE"
            },
            {
                "-entityGroupId": "6000",
                "-entityOrPackage": "UomType",
                "-applEnumId": "ESIA_INCLUDE"
            },
            {
                "-entityGroupId": "6000",
                "-entityOrPackage": "StatusItem",
                "-applEnumId": "ESIA_INCLUDE"
            },
            {
                "-entityGroupId": "6000",
                "-entityOrPackage": "StatusValidChange",
                "-applEnumId": "ESIA_INCLUDE"
            },
            {
                "-entityGroupId": "6000",
                "-entityOrPackage": "StatusType",
                "-applEnumId": "ESIA_INCLUDE"
            },
            {
                "-entityGroupId": "6000",
                "-entityOrPackage": "Enumeration",
                "-applEnumId": "ESIA_INCLUDE"
            },
            {
                "-entityOrPackage": "EnumerationType",
                "-applEnumId": "ESIA_INCLUDE",
                "-entityGroupId": "6000"
            },
            {
                "-entityGroupId": "6050",
                "-entityOrPackage": "org.apache.ofbiz.common",
                "-applEnumId": "ESIA_INCLUDE"
            },
            {
                "-entityGroupId": "6100",
                "-entityOrPackage": "org.apache.ofbiz.content.content",
                "-applEnumId": "ESIA_INCLUDE"
            },
            {
                "-entityOrPackage": "org.apache.ofbiz.content.data",
                "-applEnumId": "ESIA_INCLUDE",
                "-entityGroupId": "6100"
            },
            {
                "-applEnumId": "ESIA_INCLUDE",
                "-entityGroupId": "6110",
                "-entityOrPackage": "org.apache.ofbiz.content.survey"
            },
            {
                "-entityGroupId": "6120",
                "-entityOrPackage": "org.apache.ofbiz.content.document",
                "-applEnumId": "ESIA_INCLUDE"
            },
            {
                "-entityGroupId": "6120",
                "-entityOrPackage": "org.apache.ofbiz.content.preference",
                "-applEnumId": "ESIA_INCLUDE"
            },
            {
                "-entityGroupId": "6120",
                "-entityOrPackage": "org.apache.ofbiz.content.website",
                "-applEnumId": "ESIA_INCLUDE"
            },
            {
                "-entityGroupId": "6200",
                "-entityOrPackage": "org.apache.ofbiz.party.party",
                "-applEnumId": "ESIA_INCLUDE"
            },
            {
                "-entityGroupId": "6210",
                "-entityOrPackage": "org.apache.ofbiz.party.contact",
                "-applEnumId": "ESIA_INCLUDE"
            },
            {
                "-entityGroupId": "6220",
                "-entityOrPackage": "org.apache.ofbiz.party.communication",
                "-applEnumId": "ESIA_INCLUDE"
            },
            {
                "-entityGroupId": "6230",
                "-entityOrPackage": "org.apache.ofbiz.party.agreement",
                "-applEnumId": "ESIA_INCLUDE"
            },
            {
                "-entityGroupId": "6230",
                "-entityOrPackage": "org.apache.ofbiz.party.need",
                "-applEnumId": "ESIA_INCLUDE"
            },
            {
                "-applEnumId": "ESIA_INCLUDE",
                "-entityGroupId": "6300",
                "-entityOrPackage": "org.apache.ofbiz.product.product"
            },
            {
                "-entityGroupId": "6310",
                "-entityOrPackage": "org.apache.ofbiz.product.catalog",
                "-applEnumId": "ESIA_INCLUDE"
            },
            {
                "-applEnumId": "ESIA_INCLUDE",
                "-entityGroupId": "6310",
                "-entityOrPackage": "org.apache.ofbiz.product.category"
            },
            {
                "-entityOrPackage": "Product",
                "-applEnumId": "ESIA_INCLUDE",
                "-entityGroupId": "6310"
            },
            {
                "-entityGroupId": "6320",
                "-entityOrPackage": "org.apache.ofbiz.product.store",
                "-applEnumId": "ESIA_INCLUDE"
            },
            {
                "-applEnumId": "ESIA_INCLUDE",
                "-entityGroupId": "6330",
                "-entityOrPackage": "org.apache.ofbiz.product.config"
            },
            {
                "-entityGroupId": "6340",
                "-entityOrPackage": "org.apache.ofbiz.product.price",
                "-applEnumId": "ESIA_INCLUDE"
            },
            {
                "-entityGroupId": "6340",
                "-entityOrPackage": "org.apache.ofbiz.product.promo",
                "-applEnumId": "ESIA_INCLUDE"
            },
            {
                "-entityGroupId": "6340",
                "-entityOrPackage": "org.apache.ofbiz.product.cost",
                "-applEnumId": "ESIA_INCLUDE"
            },
            {
                "-applEnumId": "ESIA_INCLUDE",
                "-entityGroupId": "6350",
                "-entityOrPackage": "org.apache.ofbiz.product.facility"
            },
            {
                "-entityGroupId": "6360",
                "-entityOrPackage": "org.apache.ofbiz.product.feature",
                "-applEnumId": "ESIA_INCLUDE"
            },
            {
                "-entityGroupId": "6360",
                "-entityOrPackage": "Product",
                "-applEnumId": "ESIA_INCLUDE"
            },
            {
                "-applEnumId": "ESIA_INCLUDE",
                "-entityGroupId": "6360",
                "-entityOrPackage": "ProductAssoc"
            },
            {
                "-entityGroupId": "6370",
                "-entityOrPackage": "org.apache.ofbiz.product.inventory",
                "-applEnumId": "ESIA_INCLUDE"
            },
            {
                "-applEnumId": "ESIA_INCLUDE",
                "-entityGroupId": "6370",
                "-entityOrPackage": "org.apache.ofbiz.product.supplier"
            },
            {
                "-entityGroupId": "6370",
                "-entityOrPackage": "Product",
                "-applEnumId": "ESIA_INCLUDE"
            },
            {
                "-entityGroupId": "6370",
                "-entityOrPackage": "Facility",
                "-applEnumId": "ESIA_INCLUDE"
            },
            {
                "-entityGroupId": "6370",
                "-entityOrPackage": "FacilityLocation",
                "-applEnumId": "ESIA_INCLUDE"
            },
            {
                "-entityOrPackage": "org.apache.ofbiz.product.subscription",
                "-applEnumId": "ESIA_INCLUDE",
                "-entityGroupId": "6380"
            },
            {
                "-entityGroupId": "6380",
                "-entityOrPackage": "Product",
                "-applEnumId": "ESIA_INCLUDE"
            },
            {
                "-entityGroupId": "6380",
                "-entityOrPackage": "OrderItem",
                "-applEnumId": "ESIA_INCLUDE"
            },
            {
                "-entityGroupId": "6380",
                "-entityOrPackage": "ShoppingListItem",
                "-applEnumId": "ESIA_INCLUDE"
            },
            {
                "-entityGroupId": "6390",
                "-entityOrPackage": "org.apache.ofbiz.shipment.shipment",
                "-applEnumId": "ESIA_INCLUDE"
            },
            {
                "-applEnumId": "ESIA_INCLUDE",
                "-entityGroupId": "6390",
                "-entityOrPackage": "org.apache.ofbiz.shipment.issuance"
            },
            {
                "-entityGroupId": "6390",
                "-entityOrPackage": "org.apache.ofbiz.shipment.receipt",
                "-applEnumId": "ESIA_INCLUDE"
            },
            {
                "-entityGroupId": "6390",
                "-entityOrPackage": "org.apache.ofbiz.shipment.picklist",
                "-applEnumId": "ESIA_INCLUDE"
            },
            {
                "-entityGroupId": "6400",
                "-entityOrPackage": "org.apache.ofbiz.order.order",
                "-applEnumId": "ESIA_INCLUDE"
            },
            {
                "-entityGroupId": "6410",
                "-entityOrPackage": "org.apache.ofbiz.order.request",
                "-applEnumId": "ESIA_INCLUDE"
            },
            {
                "-entityGroupId": "6410",
                "-entityOrPackage": "QuoteItem",
                "-applEnumId": "ESIA_INCLUDE"
            },
            {
                "-applEnumId": "ESIA_INCLUDE",
                "-entityGroupId": "6410",
                "-entityOrPackage": "Requirement"
            },
            {
                "-entityGroupId": "6410",
                "-entityOrPackage": "WorkEffort",
                "-applEnumId": "ESIA_INCLUDE"
            },
            {
                "-entityGroupId": "6420",
                "-entityOrPackage": "org.apache.ofbiz.order.requirement",
                "-applEnumId": "ESIA_INCLUDE"
            },
            {
                "-entityGroupId": "6420",
                "-entityOrPackage": "OrderItem",
                "-applEnumId": "ESIA_INCLUDE"
            },
            {
                "-entityGroupId": "6420",
                "-entityOrPackage": "WorkEffort",
                "-applEnumId": "ESIA_INCLUDE"
            },
            {
                "-entityGroupId": "6430",
                "-entityOrPackage": "org.apache.ofbiz.order.quote",
                "-applEnumId": "ESIA_INCLUDE"
            },
            {
                "-entityGroupId": "6430",
                "-entityOrPackage": "OrderItem",
                "-applEnumId": "ESIA_INCLUDE"
            },
            {
                "-entityGroupId": "6440",
                "-entityOrPackage": "org.apache.ofbiz.order.return",
                "-applEnumId": "ESIA_INCLUDE"
            },
            {
                "-entityOrPackage": "OrderItem",
                "-applEnumId": "ESIA_INCLUDE",
                "-entityGroupId": "6440"
            },
            {
                "-entityOrPackage": "org.apache.ofbiz.marketing.opportunity",
                "-applEnumId": "ESIA_INCLUDE",
                "-entityGroupId": "6450"
            },
            {
                "-entityGroupId": "6450",
                "-entityOrPackage": "org.apache.ofbiz.order.shoppinglist",
                "-applEnumId": "ESIA_INCLUDE"
            },
            {
                "-entityGroupId": "6450",
                "-entityOrPackage": "org.apache.ofbiz.order.shoppingcart",
                "-applEnumId": "ESIA_INCLUDE"
            },
            {
                "-entityGroupId": "6500",
                "-entityOrPackage": "org.apache.ofbiz.accounting.ledger",
                "-applEnumId": "ESIA_INCLUDE"
            },
            {
                "-entityGroupId": "6510",
                "-entityOrPackage": "org.apache.ofbiz.accounting.budget",
                "-applEnumId": "ESIA_INCLUDE"
            },
            {
                "-entityGroupId": "6520",
                "-entityOrPackage": "org.apache.ofbiz.accounting.finaccount",
                "-applEnumId": "ESIA_INCLUDE"
            },
            {
                "-entityGroupId": "6530",
                "-entityOrPackage": "org.apache.ofbiz.accounting.invoice",
                "-applEnumId": "ESIA_INCLUDE"
            },
            {
                "-entityGroupId": "6530",
                "-entityOrPackage": "BillingAccount",
                "-applEnumId": "ESIA_INCLUDE"
            },
            {
                "-entityGroupId": "6530",
                "-entityOrPackage": "PaymentApplication",
                "-applEnumId": "ESIA_INCLUDE"
            },
            {
                "-entityOrPackage": "org.apache.ofbiz.accounting.payment",
                "-applEnumId": "ESIA_INCLUDE",
                "-entityGroupId": "6540"
            },
            {
                "-entityOrPackage": "org.apache.ofbiz.accounting.tax",
                "-applEnumId": "ESIA_INCLUDE",
                "-entityGroupId": "6550"
            },
            {
                "-entityGroupId": "6550",
                "-entityOrPackage": "OrderAdjustment",
                "-applEnumId": "ESIA_INCLUDE"
            },
            {
                "-entityGroupId": "6560",
                "-entityOrPackage": "org.apache.ofbiz.accounting.fixedasset",
                "-applEnumId": "ESIA_INCLUDE"
            },
            {
                "-entityGroupId": "6560",
                "-entityOrPackage": "Product",
                "-applEnumId": "ESIA_INCLUDE"
            },
            {
                "-entityGroupId": "6560",
                "-entityOrPackage": "ProductMaintType",
                "-applEnumId": "ESIA_INCLUDE"
            },
            {
                "-entityGroupId": "6560",
                "-entityOrPackage": "ProductMaint",
                "-applEnumId": "ESIA_INCLUDE"
            },
            {
                "-entityGroupId": "6560",
                "-entityOrPackage": "ProductMeterType",
                "-applEnumId": "ESIA_INCLUDE"
            },
            {
                "-entityGroupId": "6560",
                "-entityOrPackage": "ProductMeter",
                "-applEnumId": "ESIA_INCLUDE"
            },
            {
                "-entityGroupId": "6600",
                "-entityOrPackage": "org.apache.ofbiz.workeffort.timesheet",
                "-applEnumId": "ESIA_INCLUDE"
            },
            {
                "-entityGroupId": "6600",
                "-entityOrPackage": "org.apache.ofbiz.workeffort.workeffort",
                "-applEnumId": "ESIA_INCLUDE"
            },
            {
                "-entityGroupId": "6710",
                "-entityOrPackage": "org.apache.ofbiz.manufacturing.bom",
                "-applEnumId": "ESIA_INCLUDE"
            },
            {
                "-entityGroupId": "6710",
                "-entityOrPackage": "org.apache.ofbiz.manufacturing.mrp",
                "-applEnumId": "ESIA_INCLUDE"
            },
            {
                "-entityGroupId": "6710",
                "-entityOrPackage": "org.apache.ofbiz.manufacturing.techdata",
                "-applEnumId": "ESIA_INCLUDE"
            },
            {
                "-entityGroupId": "6710",
                "-entityOrPackage": "WorkEffort",
                "-applEnumId": "ESIA_INCLUDE"
            },
            {
                "-entityGroupId": "6720",
                "-entityOrPackage": "org.apache.ofbiz.humanres.ability",
                "-applEnumId": "ESIA_INCLUDE"
            },
            {
                "-entityGroupId": "6720",
                "-entityOrPackage": "org.apache.ofbiz.humanres.employment",
                "-applEnumId": "ESIA_INCLUDE"
            },
            {
                "-applEnumId": "ESIA_INCLUDE",
                "-entityGroupId": "6720",
                "-entityOrPackage": "org.apache.ofbiz.humanres.position"
            },
            {
                "-entityOrPackage": "org.apache.ofbiz.marketing.campaign",
                "-applEnumId": "ESIA_INCLUDE",
                "-entityGroupId": "6730"
            },
            {
                "-entityOrPackage": "org.apache.ofbiz.marketing.contact",
                "-applEnumId": "ESIA_INCLUDE",
                "-entityGroupId": "6730"
            },
            {
                "-entityGroupId": "6730",
                "-entityOrPackage": "org.apache.ofbiz.marketing.segment",
                "-applEnumId": "ESIA_INCLUDE"
            },
            {
                "-entityGroupId": "6730",
                "-entityOrPackage": "org.apache.ofbiz.marketing.tracking",
                "-applEnumId": "ESIA_INCLUDE"
            },
            {
                "-entityGroupId": "6800",
                "-entityOrPackage": "org.apache.ofbiz.bi",
                "-applEnumId": "ESIA_INCLUDE"
            },
            {
                "-entityGroupId": "6910",
                "-entityOrPackage": "org.apache.ofbiz.entity",
                "-applEnumId": "ESIA_INCLUDE"
            },
            {
                "-entityOrPackage": "org.apache.ofbiz.service",
                "-applEnumId": "ESIA_INCLUDE",
                "-entityGroupId": "6910"
            },
            {
                "-entityGroupId": "6920",
                "-entityOrPackage": "org.apache.ofbiz.webapp",
                "-applEnumId": "ESIA_INCLUDE"
            },
            {
                "-entityGroupId": "6920",
                "-entityOrPackage": "org.apache.ofbiz.content.website",
                "-applEnumId": "ESIA_INCLUDE"
            },
            {
                "-entityGroupId": "6930",
                "-entityOrPackage": "org.apache.ofbiz.security",
                "-applEnumId": "ESIA_INCLUDE"
            },
            {
                "-entityOrPackage": "org.apache.ofbiz.pos.terminal",
                "-applEnumId": "ESIA_INCLUDE",
                "-entityGroupId": "6990"
            },
            {
                "-entityOrPackage": "org.apache.ofbiz.plugins.oagis",
                "-applEnumId": "ESIA_INCLUDE",
                "-entityGroupId": "6990"
            },
            {
                "-entityGroupId": "6990",
                "-entityOrPackage": "org.apache.ofbiz.catalina.session",
                "-applEnumId": "ESIA_INCLUDE"
            }
        ]
    }
}