[gd_scene load_steps=3 format=3 uid="uid://5d2spivg16ff"]

[ext_resource type="Script" path="res://egg_spawner.gd" id="1_fly20"]

[sub_resource type="BoxMesh" id="BoxMesh_d7ag5"]

[node name="EggSpawner" type="Node3D"]
script = ExtResource("1_fly20")

[node name="AreaVisualizer" type="MeshInstance3D" parent="."]
visible = false
mesh = SubResource("BoxMesh_d7ag5")

[node name="Timer" type="Timer" parent="."]
one_shot = true
autostart = true

[connection signal="timeout" from="Timer" to="." method="_on_timer_timeout"]
