[gd_scene load_steps=4 format=3 uid="uid://b2yg7ate8aj2t"]

[ext_resource type="PackedScene" uid="uid://5d2spivg16ff" path="res://egg_spawner.tscn" id="1_41mei"]
[ext_resource type="PackedScene" uid="uid://b2pe2m2d5vmvb" path="res://portal_effect.tscn" id="2_pw4jm"]
[ext_resource type="PackedScene" uid="uid://b4mr8otlyf2y1" path="res://EnemyTank.tscn" id="3_q2kj1"]

[node name="EggSpawner" instance=ExtResource("1_41mei")]
wait_scene = ExtResource("2_pw4jm")
spawn_scene = ExtResource("3_q2kj1")

[node name="Timer" parent="." index="1"]
wait_time = 1.5
