[gd_scene load_steps=4 format=3 uid="uid://b4mr8otlyf2y1"]

[ext_resource type="PackedScene" uid="uid://duur7013hokt" path="res://tank.tscn" id="1_pj5dc"]
[ext_resource type="PackedScene" uid="uid://feaiwbcqq643" path="res://ai_controller.tscn" id="2_beqcj"]

[sub_resource type="StandardMaterial3D" id="StandardMaterial3D_5e807"]
resource_local_to_scene = true

[node name="EnemyTank" groups=["enemy"] instance=ExtResource("1_pj5dc")]
collision_layer = 4
collision_mask = 11
color = Color(0, 0.67451, 0.262745, 1)

[node name="MeshInstance3D" parent="." index="1"]
surface_material_override/0 = SubResource("StandardMaterial3D_5e807")

[node name="AiController" parent="." index="3" instance=ExtResource("2_beqcj")]
