{"attributes":{"buildNum":29199,"defaultIndex":"29e423c0-7ae8-11ea-8010-f99ea36f2d10"},"id":"7.6.2","references":[],"type":"config","updated_at":"2020-04-13T03:50:35.691Z","version":"WzMsMV0="}
{"attributes":{"fields":"[{\"name\":\"@timestamp\",\"type\":\"date\",\"esTypes\":[\"date\"],\"count\":0,\"scripted\":false,\"searchable\":true,\"aggregatable\":true,\"readFromDocValues\":true},{\"name\":\"@version\",\"type\":\"string\",\"esTypes\":[\"text\"],\"count\":0,\"scripted\":false,\"searchable\":true,\"aggregatable\":false,\"readFromDocValues\":false},{\"name\":\"@version.keyword\",\"type\":\"string\",\"esTypes\":[\"keyword\"],\"count\":0,\"scripted\":false,\"searchable\":true,\"aggregatable\":true,\"readFromDocValues\":true,\"subType\":{\"multi\":{\"parent\":\"@version\"}}},{\"name\":\"_id\",\"type\":\"string\",\"esTypes\":[\"_id\"],\"count\":0,\"scripted\":false,\"searchable\":true,\"aggregatable\":true,\"readFromDocValues\":false},{\"name\":\"_index\",\"type\":\"string\",\"esTypes\":[\"_index\"],\"count\":0,\"scripted\":false,\"searchable\":true,\"aggregatable\":true,\"readFromDocValues\":false},{\"name\":\"_score\",\"type\":\"number\",\"count\":0,\"scripted\":false,\"searchable\":false,\"aggregatable\":false,\"readFromDocValues\":false},{\"name\":\"_source\",\"type\":\"_source\",\"esTypes\":[\"_source\"],\"count\":0,\"scripted\":false,\"searchable\":false,\"aggregatable\":false,\"readFromDocValues\":false},{\"name\":\"_type\",\"type\":\"string\",\"esTypes\":[\"_type\"],\"count\":0,\"scripted\":false,\"searchable\":true,\"aggregatable\":true,\"readFromDocValues\":false},{\"name\":\"agent.ephemeral_id\",\"type\":\"string\",\"esTypes\":[\"text\"],\"count\":0,\"scripted\":false,\"searchable\":true,\"aggregatable\":false,\"readFromDocValues\":false},{\"name\":\"agent.ephemeral_id.keyword\",\"type\":\"string\",\"esTypes\":[\"keyword\"],\"count\":0,\"scripted\":false,\"searchable\":true,\"aggregatable\":true,\"readFromDocValues\":true,\"subType\":{\"multi\":{\"parent\":\"agent.ephemeral_id\"}}},{\"name\":\"agent.hostname\",\"type\":\"string\",\"esTypes\":[\"text\"],\"count\":0,\"scripted\":false,\"searchable\":true,\"aggregatable\":false,\"readFromDocValues\":false},{\"name\":\"agent.hostname.keyword\",\"type\":\"string\",\"esTypes\":[\"keyword\"],\"count\":0,\"scripted\":false,\"searchable\":true,\"aggregatable\":true,\"readFromDocValues\":true,\"subType\":{\"multi\":{\"parent\":\"agent.hostname\"}}},{\"name\":\"agent.id\",\"type\":\"string\",\"esTypes\":[\"text\"],\"count\":0,\"scripted\":false,\"searchable\":true,\"aggregatable\":false,\"readFromDocValues\":false},{\"name\":\"agent.id.keyword\",\"type\":\"string\",\"esTypes\":[\"keyword\"],\"count\":0,\"scripted\":false,\"searchable\":true,\"aggregatable\":true,\"readFromDocValues\":true,\"subType\":{\"multi\":{\"parent\":\"agent.id\"}}},{\"name\":\"agent.type\",\"type\":\"string\",\"esTypes\":[\"text\"],\"count\":0,\"scripted\":false,\"searchable\":true,\"aggregatable\":false,\"readFromDocValues\":false},{\"name\":\"agent.type.keyword\",\"type\":\"string\",\"esTypes\":[\"keyword\"],\"count\":0,\"scripted\":false,\"searchable\":true,\"aggregatable\":true,\"readFromDocValues\":true,\"subType\":{\"multi\":{\"parent\":\"agent.type\"}}},{\"name\":\"agent.version\",\"type\":\"string\",\"esTypes\":[\"text\"],\"count\":0,\"scripted\":false,\"searchable\":true,\"aggregatable\":false,\"readFromDocValues\":false},{\"name\":\"agent.version.keyword\",\"type\":\"string\",\"esTypes\":[\"keyword\"],\"count\":0,\"scripted\":false,\"searchable\":true,\"aggregatable\":true,\"readFromDocValues\":true,\"subType\":{\"multi\":{\"parent\":\"agent.version\"}}},{\"name\":\"app_started\",\"type\":\"string\",\"esTypes\":[\"text\"],\"count\":0,\"scripted\":false,\"searchable\":true,\"aggregatable\":false,\"readFromDocValues\":false},{\"name\":\"app_started.keyword\",\"type\":\"string\",\"esTypes\":[\"keyword\"],\"count\":0,\"scripted\":false,\"searchable\":true,\"aggregatable\":true,\"readFromDocValues\":true,\"subType\":{\"multi\":{\"parent\":\"app_started\"}}},{\"name\":\"ecs.version\",\"type\":\"string\",\"esTypes\":[\"text\"],\"count\":0,\"scripted\":false,\"searchable\":true,\"aggregatable\":false,\"readFromDocValues\":false},{\"name\":\"ecs.version.keyword\",\"type\":\"string\",\"esTypes\":[\"keyword\"],\"count\":0,\"scripted\":false,\"searchable\":true,\"aggregatable\":true,\"readFromDocValues\":true,\"subType\":{\"multi\":{\"parent\":\"ecs.version\"}}},{\"name\":\"host.name\",\"type\":\"string\",\"esTypes\":[\"text\"],\"count\":0,\"scripted\":false,\"searchable\":true,\"aggregatable\":false,\"readFromDocValues\":false},{\"name\":\"host.name.keyword\",\"type\":\"string\",\"esTypes\":[\"keyword\"],\"count\":0,\"scripted\":false,\"searchable\":true,\"aggregatable\":true,\"readFromDocValues\":true,\"subType\":{\"multi\":{\"parent\":\"host.name\"}}},{\"name\":\"input.type\",\"type\":\"string\",\"esTypes\":[\"text\"],\"count\":0,\"scripted\":false,\"searchable\":true,\"aggregatable\":false,\"readFromDocValues\":false},{\"name\":\"input.type.keyword\",\"type\":\"string\",\"esTypes\":[\"keyword\"],\"count\":0,\"scripted\":false,\"searchable\":true,\"aggregatable\":true,\"readFromDocValues\":true,\"subType\":{\"multi\":{\"parent\":\"input.type\"}}},{\"name\":\"log.file.path\",\"type\":\"string\",\"esTypes\":[\"text\"],\"count\":0,\"scripted\":false,\"searchable\":true,\"aggregatable\":false,\"readFromDocValues\":false},{\"name\":\"log.file.path.keyword\",\"type\":\"string\",\"esTypes\":[\"keyword\"],\"count\":0,\"scripted\":false,\"searchable\":true,\"aggregatable\":true,\"readFromDocValues\":true,\"subType\":{\"multi\":{\"parent\":\"log.file.path\"}}},{\"name\":\"log.offset\",\"type\":\"number\",\"esTypes\":[\"long\"],\"count\":0,\"scripted\":false,\"searchable\":true,\"aggregatable\":true,\"readFromDocValues\":true},{\"name\":\"tags\",\"type\":\"string\",\"esTypes\":[\"text\"],\"count\":0,\"scripted\":false,\"searchable\":true,\"aggregatable\":false,\"readFromDocValues\":false},{\"name\":\"tags.keyword\",\"type\":\"string\",\"esTypes\":[\"keyword\"],\"count\":0,\"scripted\":false,\"searchable\":true,\"aggregatable\":true,\"readFromDocValues\":true,\"subType\":{\"multi\":{\"parent\":\"tags\"}}}]","timeFieldName":"@timestamp","title":"filebeat-app_starts*"},"id":"29e423c0-7ae8-11ea-8010-f99ea36f2d10","migrationVersion":{"index-pattern":"7.6.0"},"references":[],"type":"index-pattern","updated_at":"2020-04-13T03:50:35.691Z","version":"WzQsMV0="}
{"attributes":{"description":"","kibanaSavedObjectMeta":{"searchSourceJSON":"{\"indexRefName\":\"kibanaSavedObjectMeta.searchSourceJSON.index\"}"},"title":"App Starts","uiStateJSON":"{}","version":1,"visState":"{\"title\":\"App Starts\",\"type\":\"histogram\",\"params\":{\"addLegend\":true,\"addTimeMarker\":false,\"addTooltip\":true,\"categoryAxes\":[{\"id\":\"CategoryAxis-1\",\"labels\":{\"filter\":true,\"show\":true,\"truncate\":100},\"position\":\"bottom\",\"scale\":{\"type\":\"linear\"},\"show\":true,\"style\":{},\"title\":{},\"type\":\"category\"}],\"dimensions\":{\"x\":{\"accessor\":0,\"format\":{\"id\":\"date\",\"params\":{\"pattern\":\"HH:mm\"}},\"params\":{\"date\":true,\"interval\":\"PT30M\",\"intervalESValue\":30,\"intervalESUnit\":\"m\",\"format\":\"HH:mm\",\"bounds\":{\"min\":\"2020-04-09T05:37:13.524Z\",\"max\":\"2020-04-10T05:37:13.524Z\"}},\"label\":\"@timestamp per 30 minutes\",\"aggType\":\"date_histogram\"},\"y\":[{\"accessor\":2,\"format\":{\"id\":\"number\"},\"params\":{},\"label\":\"Count\",\"aggType\":\"count\"}],\"splitColumn\":[{\"accessor\":1,\"format\":{\"id\":\"terms\",\"params\":{\"id\":\"string\",\"otherBucketLabel\":\"Other\",\"missingBucketLabel\":\"Missing\",\"parsedUrl\":{\"origin\":\"http://192.168.0.10:5601\",\"pathname\":\"/app/kibana\",\"basePath\":\"\"}}},\"params\":{},\"label\":\"app_started.keyword: Descending\",\"aggType\":\"terms\"}]},\"grid\":{\"categoryLines\":false},\"labels\":{\"show\":false},\"legendPosition\":\"right\",\"seriesParams\":[{\"data\":{\"id\":\"1\",\"label\":\"Count\"},\"drawLinesBetweenPoints\":true,\"lineWidth\":2,\"mode\":\"stacked\",\"show\":true,\"showCircles\":true,\"type\":\"histogram\",\"valueAxis\":\"ValueAxis-1\"}],\"thresholdLine\":{\"color\":\"#E7664C\",\"show\":false,\"style\":\"full\",\"value\":10,\"width\":1},\"times\":[],\"type\":\"histogram\",\"valueAxes\":[{\"id\":\"ValueAxis-1\",\"labels\":{\"filter\":false,\"rotate\":0,\"show\":true,\"truncate\":100},\"name\":\"LeftAxis-1\",\"position\":\"left\",\"scale\":{\"mode\":\"normal\",\"type\":\"linear\"},\"show\":true,\"style\":{},\"title\":{\"text\":\"Count\"},\"type\":\"value\"}]},\"aggs\":[{\"id\":\"1\",\"enabled\":true,\"type\":\"count\",\"schema\":\"metric\",\"params\":{}},{\"id\":\"2\",\"enabled\":true,\"type\":\"date_histogram\",\"schema\":\"segment\",\"params\":{\"field\":\"@timestamp\",\"timeRange\":{\"from\":\"now-1d\",\"to\":\"now\"},\"useNormalizedEsInterval\":true,\"scaleMetricValues\":false,\"interval\":\"auto\",\"drop_partials\":false,\"min_doc_count\":1,\"extended_bounds\":{}}},{\"id\":\"3\",\"enabled\":true,\"type\":\"terms\",\"schema\":\"split\",\"params\":{\"field\":\"app_started.keyword\",\"orderBy\":\"1\",\"order\":\"desc\",\"size\":5,\"otherBucket\":false,\"otherBucketLabel\":\"Other\",\"missingBucket\":false,\"missingBucketLabel\":\"Missing\",\"customLabel\":\"action\",\"row\":false}}]}"},"id":"4aab2440-7ae9-11ea-8010-f99ea36f2d10","migrationVersion":{"visualization":"7.4.2"},"references":[{"id":"29e423c0-7ae8-11ea-8010-f99ea36f2d10","name":"kibanaSavedObjectMeta.searchSourceJSON.index","type":"index-pattern"}],"type":"visualization","updated_at":"2020-04-13T04:20:12.686Z","version":"WzE1LDFd"}
{"attributes":{"fields":"[{\"name\":\"@timestamp\",\"type\":\"date\",\"esTypes\":[\"date\"],\"count\":0,\"scripted\":false,\"searchable\":true,\"aggregatable\":true,\"readFromDocValues\":true},{\"name\":\"@version\",\"type\":\"string\",\"esTypes\":[\"text\"],\"count\":0,\"scripted\":false,\"searchable\":true,\"aggregatable\":false,\"readFromDocValues\":false},{\"name\":\"@version.keyword\",\"type\":\"string\",\"esTypes\":[\"keyword\"],\"count\":0,\"scripted\":false,\"searchable\":true,\"aggregatable\":true,\"readFromDocValues\":true,\"subType\":{\"multi\":{\"parent\":\"@version\"}}},{\"name\":\"_id\",\"type\":\"string\",\"esTypes\":[\"_id\"],\"count\":0,\"scripted\":false,\"searchable\":true,\"aggregatable\":true,\"readFromDocValues\":false},{\"name\":\"_index\",\"type\":\"string\",\"esTypes\":[\"_index\"],\"count\":0,\"scripted\":false,\"searchable\":true,\"aggregatable\":true,\"readFromDocValues\":false},{\"name\":\"_score\",\"type\":\"number\",\"count\":0,\"scripted\":false,\"searchable\":false,\"aggregatable\":false,\"readFromDocValues\":false},{\"name\":\"_source\",\"type\":\"_source\",\"esTypes\":[\"_source\"],\"count\":0,\"scripted\":false,\"searchable\":false,\"aggregatable\":false,\"readFromDocValues\":false},{\"name\":\"_type\",\"type\":\"string\",\"esTypes\":[\"_type\"],\"count\":0,\"scripted\":false,\"searchable\":true,\"aggregatable\":true,\"readFromDocValues\":false},{\"name\":\"agent.ephemeral_id\",\"type\":\"string\",\"esTypes\":[\"text\"],\"count\":0,\"scripted\":false,\"searchable\":true,\"aggregatable\":false,\"readFromDocValues\":false},{\"name\":\"agent.ephemeral_id.keyword\",\"type\":\"string\",\"esTypes\":[\"keyword\"],\"count\":0,\"scripted\":false,\"searchable\":true,\"aggregatable\":true,\"readFromDocValues\":true,\"subType\":{\"multi\":{\"parent\":\"agent.ephemeral_id\"}}},{\"name\":\"agent.hostname\",\"type\":\"string\",\"esTypes\":[\"text\"],\"count\":0,\"scripted\":false,\"searchable\":true,\"aggregatable\":false,\"readFromDocValues\":false},{\"name\":\"agent.hostname.keyword\",\"type\":\"string\",\"esTypes\":[\"keyword\"],\"count\":0,\"scripted\":false,\"searchable\":true,\"aggregatable\":true,\"readFromDocValues\":true,\"subType\":{\"multi\":{\"parent\":\"agent.hostname\"}}},{\"name\":\"agent.id\",\"type\":\"string\",\"esTypes\":[\"text\"],\"count\":0,\"scripted\":false,\"searchable\":true,\"aggregatable\":false,\"readFromDocValues\":false},{\"name\":\"agent.id.keyword\",\"type\":\"string\",\"esTypes\":[\"keyword\"],\"count\":0,\"scripted\":false,\"searchable\":true,\"aggregatable\":true,\"readFromDocValues\":true,\"subType\":{\"multi\":{\"parent\":\"agent.id\"}}},{\"name\":\"agent.type\",\"type\":\"string\",\"esTypes\":[\"text\"],\"count\":0,\"scripted\":false,\"searchable\":true,\"aggregatable\":false,\"readFromDocValues\":false},{\"name\":\"agent.type.keyword\",\"type\":\"string\",\"esTypes\":[\"keyword\"],\"count\":0,\"scripted\":false,\"searchable\":true,\"aggregatable\":true,\"readFromDocValues\":true,\"subType\":{\"multi\":{\"parent\":\"agent.type\"}}},{\"name\":\"agent.version\",\"type\":\"string\",\"esTypes\":[\"text\"],\"count\":0,\"scripted\":false,\"searchable\":true,\"aggregatable\":false,\"readFromDocValues\":false},{\"name\":\"agent.version.keyword\",\"type\":\"string\",\"esTypes\":[\"keyword\"],\"count\":0,\"scripted\":false,\"searchable\":true,\"aggregatable\":true,\"readFromDocValues\":true,\"subType\":{\"multi\":{\"parent\":\"agent.version\"}}},{\"name\":\"codeline\",\"type\":\"string\",\"esTypes\":[\"text\"],\"count\":0,\"scripted\":false,\"searchable\":true,\"aggregatable\":false,\"readFromDocValues\":false},{\"name\":\"codeline.keyword\",\"type\":\"string\",\"esTypes\":[\"keyword\"],\"count\":0,\"scripted\":false,\"searchable\":true,\"aggregatable\":true,\"readFromDocValues\":true,\"subType\":{\"multi\":{\"parent\":\"codeline\"}}},{\"name\":\"ecs.version\",\"type\":\"string\",\"esTypes\":[\"text\"],\"count\":0,\"scripted\":false,\"searchable\":true,\"aggregatable\":false,\"readFromDocValues\":false},{\"name\":\"ecs.version.keyword\",\"type\":\"string\",\"esTypes\":[\"keyword\"],\"count\":0,\"scripted\":false,\"searchable\":true,\"aggregatable\":true,\"readFromDocValues\":true,\"subType\":{\"multi\":{\"parent\":\"ecs.version\"}}},{\"name\":\"host.name\",\"type\":\"string\",\"esTypes\":[\"text\"],\"count\":0,\"scripted\":false,\"searchable\":true,\"aggregatable\":false,\"readFromDocValues\":false},{\"name\":\"host.name.keyword\",\"type\":\"string\",\"esTypes\":[\"keyword\"],\"count\":0,\"scripted\":false,\"searchable\":true,\"aggregatable\":true,\"readFromDocValues\":true,\"subType\":{\"multi\":{\"parent\":\"host.name\"}}},{\"name\":\"input.type\",\"type\":\"string\",\"esTypes\":[\"text\"],\"count\":0,\"scripted\":false,\"searchable\":true,\"aggregatable\":false,\"readFromDocValues\":false},{\"name\":\"input.type.keyword\",\"type\":\"string\",\"esTypes\":[\"keyword\"],\"count\":0,\"scripted\":false,\"searchable\":true,\"aggregatable\":true,\"readFromDocValues\":true,\"subType\":{\"multi\":{\"parent\":\"input.type\"}}},{\"name\":\"log.file.path\",\"type\":\"string\",\"esTypes\":[\"text\"],\"count\":0,\"scripted\":false,\"searchable\":true,\"aggregatable\":false,\"readFromDocValues\":false},{\"name\":\"log.file.path.keyword\",\"type\":\"string\",\"esTypes\":[\"keyword\"],\"count\":0,\"scripted\":false,\"searchable\":true,\"aggregatable\":true,\"readFromDocValues\":true,\"subType\":{\"multi\":{\"parent\":\"log.file.path\"}}},{\"name\":\"log.offset\",\"type\":\"number\",\"esTypes\":[\"long\"],\"count\":0,\"scripted\":false,\"searchable\":true,\"aggregatable\":true,\"readFromDocValues\":true},{\"name\":\"module\",\"type\":\"string\",\"esTypes\":[\"text\"],\"count\":0,\"scripted\":false,\"searchable\":true,\"aggregatable\":false,\"readFromDocValues\":false},{\"name\":\"module.keyword\",\"type\":\"string\",\"esTypes\":[\"keyword\"],\"count\":0,\"scripted\":false,\"searchable\":true,\"aggregatable\":true,\"readFromDocValues\":true,\"subType\":{\"multi\":{\"parent\":\"module\"}}},{\"name\":\"pkg\",\"type\":\"string\",\"esTypes\":[\"text\"],\"count\":0,\"scripted\":false,\"searchable\":true,\"aggregatable\":false,\"readFromDocValues\":false},{\"name\":\"pkg.keyword\",\"type\":\"string\",\"esTypes\":[\"keyword\"],\"count\":0,\"scripted\":false,\"searchable\":true,\"aggregatable\":true,\"readFromDocValues\":true,\"subType\":{\"multi\":{\"parent\":\"pkg\"}}},{\"name\":\"process\",\"type\":\"string\",\"esTypes\":[\"text\"],\"count\":0,\"scripted\":false,\"searchable\":true,\"aggregatable\":false,\"readFromDocValues\":false},{\"name\":\"process.keyword\",\"type\":\"string\",\"esTypes\":[\"keyword\"],\"count\":0,\"scripted\":false,\"searchable\":true,\"aggregatable\":true,\"readFromDocValues\":true,\"subType\":{\"multi\":{\"parent\":\"process\"}}},{\"name\":\"tags\",\"type\":\"string\",\"esTypes\":[\"text\"],\"count\":0,\"scripted\":false,\"searchable\":true,\"aggregatable\":false,\"readFromDocValues\":false},{\"name\":\"tags.keyword\",\"type\":\"string\",\"esTypes\":[\"keyword\"],\"count\":0,\"scripted\":false,\"searchable\":true,\"aggregatable\":true,\"readFromDocValues\":true,\"subType\":{\"multi\":{\"parent\":\"tags\"}}},{\"name\":\"thread\",\"type\":\"string\",\"esTypes\":[\"text\"],\"count\":0,\"scripted\":false,\"searchable\":true,\"aggregatable\":false,\"readFromDocValues\":false},{\"name\":\"thread.keyword\",\"type\":\"string\",\"esTypes\":[\"keyword\"],\"count\":0,\"scripted\":false,\"searchable\":true,\"aggregatable\":true,\"readFromDocValues\":true,\"subType\":{\"multi\":{\"parent\":\"thread\"}}},{\"name\":\"timestamp\",\"type\":\"date\",\"esTypes\":[\"date\"],\"count\":0,\"scripted\":false,\"searchable\":true,\"aggregatable\":true,\"readFromDocValues\":true},{\"name\":\"user_action\",\"type\":\"string\",\"esTypes\":[\"text\"],\"count\":0,\"scripted\":false,\"searchable\":true,\"aggregatable\":false,\"readFromDocValues\":false},{\"name\":\"user_action.keyword\",\"type\":\"string\",\"esTypes\":[\"keyword\"],\"count\":0,\"scripted\":false,\"searchable\":true,\"aggregatable\":true,\"readFromDocValues\":true,\"subType\":{\"multi\":{\"parent\":\"user_action\"}}},{\"name\":\"user_id\",\"type\":\"number\",\"esTypes\":[\"long\"],\"count\":0,\"scripted\":false,\"searchable\":true,\"aggregatable\":true,\"readFromDocValues\":true}]","timeFieldName":"@timestamp","title":"filebeat-user_connections*"},"id":"4e259a70-7ae8-11ea-8010-f99ea36f2d10","migrationVersion":{"index-pattern":"7.6.0"},"references":[],"type":"index-pattern","updated_at":"2020-04-13T03:50:35.691Z","version":"WzYsMV0="}
{"attributes":{"description":"","kibanaSavedObjectMeta":{"searchSourceJSON":"{\"indexRefName\":\"kibanaSavedObjectMeta.searchSourceJSON.index\"}"},"title":"Users Connections","uiStateJSON":"{}","version":1,"visState":"{\"title\":\"Users Connections\",\"type\":\"histogram\",\"params\":{\"type\":\"histogram\",\"grid\":{\"categoryLines\":false},\"categoryAxes\":[{\"id\":\"CategoryAxis-1\",\"type\":\"category\",\"position\":\"bottom\",\"show\":true,\"style\":{},\"scale\":{\"type\":\"linear\"},\"labels\":{\"show\":true,\"filter\":true,\"truncate\":100},\"title\":{}}],\"valueAxes\":[{\"id\":\"ValueAxis-1\",\"name\":\"LeftAxis-1\",\"type\":\"value\",\"position\":\"left\",\"show\":true,\"style\":{},\"scale\":{\"type\":\"linear\",\"mode\":\"normal\"},\"labels\":{\"show\":true,\"rotate\":0,\"filter\":false,\"truncate\":100},\"title\":{\"text\":\"Count\"}}],\"seriesParams\":[{\"show\":true,\"type\":\"histogram\",\"mode\":\"stacked\",\"data\":{\"label\":\"Count\",\"id\":\"1\"},\"valueAxis\":\"ValueAxis-1\",\"drawLinesBetweenPoints\":true,\"lineWidth\":2,\"showCircles\":true}],\"addTooltip\":true,\"addLegend\":true,\"legendPosition\":\"right\",\"times\":[],\"addTimeMarker\":false,\"labels\":{\"show\":false},\"thresholdLine\":{\"show\":false,\"value\":10,\"width\":1,\"style\":\"full\",\"color\":\"#E7664C\"},\"dimensions\":{\"x\":{\"accessor\":0,\"format\":{\"id\":\"date\",\"params\":{\"pattern\":\"HH:mm\"}},\"params\":{\"date\":true,\"interval\":\"PT5M\",\"intervalESValue\":5,\"intervalESUnit\":\"m\",\"format\":\"HH:mm\",\"bounds\":{\"min\":\"2020-04-10T02:54:24.946Z\",\"max\":\"2020-04-10T05:54:24.946Z\"}},\"label\":\"@timestamp per 5 minutes\",\"aggType\":\"date_histogram\"},\"y\":[{\"accessor\":2,\"format\":{\"id\":\"number\"},\"params\":{},\"label\":\"Count\",\"aggType\":\"count\"}],\"series\":[{\"accessor\":1,\"format\":{\"id\":\"terms\",\"params\":{\"id\":\"string\",\"otherBucketLabel\":\"Other\",\"missingBucketLabel\":\"Missing\",\"parsedUrl\":{\"origin\":\"http://192.168.0.10:5601\",\"pathname\":\"/app/kibana\",\"basePath\":\"\"}}},\"params\":{},\"label\":\"action\",\"aggType\":\"terms\"}]}},\"aggs\":[{\"id\":\"1\",\"enabled\":true,\"type\":\"count\",\"schema\":\"metric\",\"params\":{}},{\"id\":\"2\",\"enabled\":true,\"type\":\"date_histogram\",\"schema\":\"segment\",\"params\":{\"field\":\"@timestamp\",\"timeRange\":{\"from\":\"now-3h\",\"to\":\"now\"},\"useNormalizedEsInterval\":true,\"scaleMetricValues\":false,\"interval\":\"auto\",\"drop_partials\":false,\"min_doc_count\":1,\"extended_bounds\":{}}},{\"id\":\"3\",\"enabled\":true,\"type\":\"terms\",\"schema\":\"split\",\"params\":{\"field\":\"user_action.keyword\",\"orderBy\":\"1\",\"order\":\"desc\",\"size\":5,\"otherBucket\":false,\"otherBucketLabel\":\"Other\",\"missingBucket\":false,\"missingBucketLabel\":\"Missing\",\"customLabel\":\"action\",\"row\":true}}]}"},"id":"82547350-7aea-11ea-8010-f99ea36f2d10","migrationVersion":{"visualization":"7.4.2"},"references":[{"id":"4e259a70-7ae8-11ea-8010-f99ea36f2d10","name":"kibanaSavedObjectMeta.searchSourceJSON.index","type":"index-pattern"}],"type":"visualization","updated_at":"2020-04-13T03:50:35.691Z","version":"WzcsMV0="}
{"attributes":{"fields":"[{\"name\":\"@timestamp\",\"type\":\"date\",\"esTypes\":[\"date\"],\"count\":0,\"scripted\":false,\"searchable\":true,\"aggregatable\":true,\"readFromDocValues\":true},{\"name\":\"@version\",\"type\":\"string\",\"esTypes\":[\"text\"],\"count\":0,\"scripted\":false,\"searchable\":true,\"aggregatable\":false,\"readFromDocValues\":false},{\"name\":\"@version.keyword\",\"type\":\"string\",\"esTypes\":[\"keyword\"],\"count\":0,\"scripted\":false,\"searchable\":true,\"aggregatable\":true,\"readFromDocValues\":true,\"subType\":{\"multi\":{\"parent\":\"@version\"}}},{\"name\":\"_id\",\"type\":\"string\",\"esTypes\":[\"_id\"],\"count\":0,\"scripted\":false,\"searchable\":true,\"aggregatable\":true,\"readFromDocValues\":false},{\"name\":\"_index\",\"type\":\"string\",\"esTypes\":[\"_index\"],\"count\":0,\"scripted\":false,\"searchable\":true,\"aggregatable\":true,\"readFromDocValues\":false},{\"name\":\"_score\",\"type\":\"number\",\"count\":0,\"scripted\":false,\"searchable\":false,\"aggregatable\":false,\"readFromDocValues\":false},{\"name\":\"_source\",\"type\":\"_source\",\"esTypes\":[\"_source\"],\"count\":0,\"scripted\":false,\"searchable\":false,\"aggregatable\":false,\"readFromDocValues\":false},{\"name\":\"_type\",\"type\":\"string\",\"esTypes\":[\"_type\"],\"count\":0,\"scripted\":false,\"searchable\":true,\"aggregatable\":true,\"readFromDocValues\":false},{\"name\":\"agent.ephemeral_id\",\"type\":\"string\",\"esTypes\":[\"text\"],\"count\":0,\"scripted\":false,\"searchable\":true,\"aggregatable\":false,\"readFromDocValues\":false},{\"name\":\"agent.ephemeral_id.keyword\",\"type\":\"string\",\"esTypes\":[\"keyword\"],\"count\":0,\"scripted\":false,\"searchable\":true,\"aggregatable\":true,\"readFromDocValues\":true,\"subType\":{\"multi\":{\"parent\":\"agent.ephemeral_id\"}}},{\"name\":\"agent.hostname\",\"type\":\"string\",\"esTypes\":[\"text\"],\"count\":0,\"scripted\":false,\"searchable\":true,\"aggregatable\":false,\"readFromDocValues\":false},{\"name\":\"agent.hostname.keyword\",\"type\":\"string\",\"esTypes\":[\"keyword\"],\"count\":0,\"scripted\":false,\"searchable\":true,\"aggregatable\":true,\"readFromDocValues\":true,\"subType\":{\"multi\":{\"parent\":\"agent.hostname\"}}},{\"name\":\"agent.id\",\"type\":\"string\",\"esTypes\":[\"text\"],\"count\":0,\"scripted\":false,\"searchable\":true,\"aggregatable\":false,\"readFromDocValues\":false},{\"name\":\"agent.id.keyword\",\"type\":\"string\",\"esTypes\":[\"keyword\"],\"count\":0,\"scripted\":false,\"searchable\":true,\"aggregatable\":true,\"readFromDocValues\":true,\"subType\":{\"multi\":{\"parent\":\"agent.id\"}}},{\"name\":\"agent.type\",\"type\":\"string\",\"esTypes\":[\"text\"],\"count\":0,\"scripted\":false,\"searchable\":true,\"aggregatable\":false,\"readFromDocValues\":false},{\"name\":\"agent.type.keyword\",\"type\":\"string\",\"esTypes\":[\"keyword\"],\"count\":0,\"scripted\":false,\"searchable\":true,\"aggregatable\":true,\"readFromDocValues\":true,\"subType\":{\"multi\":{\"parent\":\"agent.type\"}}},{\"name\":\"agent.version\",\"type\":\"string\",\"esTypes\":[\"text\"],\"count\":0,\"scripted\":false,\"searchable\":true,\"aggregatable\":false,\"readFromDocValues\":false},{\"name\":\"agent.version.keyword\",\"type\":\"string\",\"esTypes\":[\"keyword\"],\"count\":0,\"scripted\":false,\"searchable\":true,\"aggregatable\":true,\"readFromDocValues\":true,\"subType\":{\"multi\":{\"parent\":\"agent.version\"}}},{\"name\":\"codeline\",\"type\":\"string\",\"esTypes\":[\"text\"],\"count\":0,\"scripted\":false,\"searchable\":true,\"aggregatable\":false,\"readFromDocValues\":false},{\"name\":\"codeline.keyword\",\"type\":\"string\",\"esTypes\":[\"keyword\"],\"count\":0,\"scripted\":false,\"searchable\":true,\"aggregatable\":true,\"readFromDocValues\":true,\"subType\":{\"multi\":{\"parent\":\"codeline\"}}},{\"name\":\"ecs.version\",\"type\":\"string\",\"esTypes\":[\"text\"],\"count\":0,\"scripted\":false,\"searchable\":true,\"aggregatable\":false,\"readFromDocValues\":false},{\"name\":\"ecs.version.keyword\",\"type\":\"string\",\"esTypes\":[\"keyword\"],\"count\":0,\"scripted\":false,\"searchable\":true,\"aggregatable\":true,\"readFromDocValues\":true,\"subType\":{\"multi\":{\"parent\":\"ecs.version\"}}},{\"name\":\"host.name\",\"type\":\"string\",\"esTypes\":[\"text\"],\"count\":0,\"scripted\":false,\"searchable\":true,\"aggregatable\":false,\"readFromDocValues\":false},{\"name\":\"host.name.keyword\",\"type\":\"string\",\"esTypes\":[\"keyword\"],\"count\":0,\"scripted\":false,\"searchable\":true,\"aggregatable\":true,\"readFromDocValues\":true,\"subType\":{\"multi\":{\"parent\":\"host.name\"}}},{\"name\":\"input.type\",\"type\":\"string\",\"esTypes\":[\"text\"],\"count\":0,\"scripted\":false,\"searchable\":true,\"aggregatable\":false,\"readFromDocValues\":false},{\"name\":\"input.type.keyword\",\"type\":\"string\",\"esTypes\":[\"keyword\"],\"count\":0,\"scripted\":false,\"searchable\":true,\"aggregatable\":true,\"readFromDocValues\":true,\"subType\":{\"multi\":{\"parent\":\"input.type\"}}},{\"name\":\"log.file.path\",\"type\":\"string\",\"esTypes\":[\"text\"],\"count\":0,\"scripted\":false,\"searchable\":true,\"aggregatable\":false,\"readFromDocValues\":false},{\"name\":\"log.file.path.keyword\",\"type\":\"string\",\"esTypes\":[\"keyword\"],\"count\":0,\"scripted\":false,\"searchable\":true,\"aggregatable\":true,\"readFromDocValues\":true,\"subType\":{\"multi\":{\"parent\":\"log.file.path\"}}},{\"name\":\"log.offset\",\"type\":\"number\",\"esTypes\":[\"long\"],\"count\":0,\"scripted\":false,\"searchable\":true,\"aggregatable\":true,\"readFromDocValues\":true},{\"name\":\"module\",\"type\":\"string\",\"esTypes\":[\"text\"],\"count\":0,\"scripted\":false,\"searchable\":true,\"aggregatable\":false,\"readFromDocValues\":false},{\"name\":\"module.keyword\",\"type\":\"string\",\"esTypes\":[\"keyword\"],\"count\":0,\"scripted\":false,\"searchable\":true,\"aggregatable\":true,\"readFromDocValues\":true,\"subType\":{\"multi\":{\"parent\":\"module\"}}},{\"name\":\"money_amount\",\"type\":\"number\",\"esTypes\":[\"float\"],\"count\":0,\"scripted\":false,\"searchable\":true,\"aggregatable\":true,\"readFromDocValues\":true},{\"name\":\"pkg\",\"type\":\"string\",\"esTypes\":[\"text\"],\"count\":0,\"scripted\":false,\"searchable\":true,\"aggregatable\":false,\"readFromDocValues\":false},{\"name\":\"pkg.keyword\",\"type\":\"string\",\"esTypes\":[\"keyword\"],\"count\":0,\"scripted\":false,\"searchable\":true,\"aggregatable\":true,\"readFromDocValues\":true,\"subType\":{\"multi\":{\"parent\":\"pkg\"}}},{\"name\":\"process\",\"type\":\"string\",\"esTypes\":[\"text\"],\"count\":0,\"scripted\":false,\"searchable\":true,\"aggregatable\":false,\"readFromDocValues\":false},{\"name\":\"process.keyword\",\"type\":\"string\",\"esTypes\":[\"keyword\"],\"count\":0,\"scripted\":false,\"searchable\":true,\"aggregatable\":true,\"readFromDocValues\":true,\"subType\":{\"multi\":{\"parent\":\"process\"}}},{\"name\":\"tags\",\"type\":\"string\",\"esTypes\":[\"text\"],\"count\":0,\"scripted\":false,\"searchable\":true,\"aggregatable\":false,\"readFromDocValues\":false},{\"name\":\"tags.keyword\",\"type\":\"string\",\"esTypes\":[\"keyword\"],\"count\":0,\"scripted\":false,\"searchable\":true,\"aggregatable\":true,\"readFromDocValues\":true,\"subType\":{\"multi\":{\"parent\":\"tags\"}}},{\"name\":\"thread\",\"type\":\"string\",\"esTypes\":[\"text\"],\"count\":0,\"scripted\":false,\"searchable\":true,\"aggregatable\":false,\"readFromDocValues\":false},{\"name\":\"thread.keyword\",\"type\":\"string\",\"esTypes\":[\"keyword\"],\"count\":0,\"scripted\":false,\"searchable\":true,\"aggregatable\":true,\"readFromDocValues\":true,\"subType\":{\"multi\":{\"parent\":\"thread\"}}},{\"name\":\"timestamp\",\"type\":\"date\",\"esTypes\":[\"date\"],\"count\":0,\"scripted\":false,\"searchable\":true,\"aggregatable\":true,\"readFromDocValues\":true},{\"name\":\"transaction_id\",\"type\":\"number\",\"esTypes\":[\"long\"],\"count\":0,\"scripted\":false,\"searchable\":true,\"aggregatable\":true,\"readFromDocValues\":true},{\"name\":\"user_action\",\"type\":\"string\",\"esTypes\":[\"text\"],\"count\":0,\"scripted\":false,\"searchable\":true,\"aggregatable\":false,\"readFromDocValues\":false},{\"name\":\"user_action.keyword\",\"type\":\"string\",\"esTypes\":[\"keyword\"],\"count\":0,\"scripted\":false,\"searchable\":true,\"aggregatable\":true,\"readFromDocValues\":true,\"subType\":{\"multi\":{\"parent\":\"user_action\"}}},{\"name\":\"user_id\",\"type\":\"number\",\"esTypes\":[\"long\"],\"count\":0,\"scripted\":false,\"searchable\":true,\"aggregatable\":true,\"readFromDocValues\":true}]","timeFieldName":"@timestamp","title":"filebeat-user_transactions*"},"id":"6b4bc2f0-7ae8-11ea-8010-f99ea36f2d10","migrationVersion":{"index-pattern":"7.6.0"},"references":[],"type":"index-pattern","updated_at":"2020-04-13T03:50:35.691Z","version":"WzgsMV0="}
{"attributes":{"description":"","kibanaSavedObjectMeta":{"searchSourceJSON":"{\"indexRefName\":\"kibanaSavedObjectMeta.searchSourceJSON.index\"}"},"title":"Users Payments Amounts","uiStateJSON":"{}","version":1,"visState":"{\"title\":\"Users Payments Amounts\",\"type\":\"histogram\",\"params\":{\"type\":\"histogram\",\"grid\":{\"categoryLines\":false},\"categoryAxes\":[{\"id\":\"CategoryAxis-1\",\"type\":\"category\",\"position\":\"bottom\",\"show\":true,\"style\":{},\"scale\":{\"type\":\"linear\"},\"labels\":{\"show\":true,\"filter\":true,\"truncate\":100},\"title\":{}}],\"valueAxes\":[{\"id\":\"ValueAxis-1\",\"name\":\"LeftAxis-1\",\"type\":\"value\",\"position\":\"left\",\"show\":true,\"style\":{},\"scale\":{\"type\":\"linear\",\"mode\":\"normal\"},\"labels\":{\"show\":true,\"rotate\":0,\"filter\":false,\"truncate\":100},\"title\":{\"text\":\"Count\"}}],\"seriesParams\":[{\"show\":true,\"type\":\"histogram\",\"mode\":\"stacked\",\"data\":{\"label\":\"Count\",\"id\":\"1\"},\"valueAxis\":\"ValueAxis-1\",\"drawLinesBetweenPoints\":true,\"lineWidth\":2,\"showCircles\":true}],\"addTooltip\":true,\"addLegend\":true,\"legendPosition\":\"right\",\"times\":[],\"addTimeMarker\":false,\"labels\":{\"show\":false},\"thresholdLine\":{\"show\":false,\"value\":10,\"width\":1,\"style\":\"full\",\"color\":\"#E7664C\"},\"dimensions\":{\"x\":{\"accessor\":0,\"format\":{\"id\":\"terms\",\"params\":{\"id\":\"string\",\"otherBucketLabel\":\"Other\",\"missingBucketLabel\":\"Missing\",\"parsedUrl\":{\"origin\":\"http://192.168.0.10:5601\",\"pathname\":\"/app/kibana\",\"basePath\":\"\"}}},\"params\":{},\"label\":\"action\",\"aggType\":\"terms\"},\"y\":[{\"accessor\":2,\"format\":{\"id\":\"number\"},\"params\":{},\"label\":\"Count\",\"aggType\":\"count\"}],\"splitColumn\":[{\"accessor\":1,\"format\":{\"id\":\"date\",\"params\":{\"pattern\":\"HH:mm\"}},\"params\":{},\"label\":\"@timestamp per 5 minutes\",\"aggType\":\"date_histogram\"}]}},\"aggs\":[{\"id\":\"1\",\"enabled\":true,\"type\":\"count\",\"schema\":\"metric\",\"params\":{}},{\"id\":\"2\",\"enabled\":true,\"type\":\"date_histogram\",\"schema\":\"segment\",\"params\":{\"field\":\"@timestamp\",\"useNormalizedEsInterval\":true,\"scaleMetricValues\":false,\"interval\":\"auto\",\"drop_partials\":false,\"min_doc_count\":1,\"extended_bounds\":{}}}]}"},"id":"d1347280-7aeb-11ea-8010-f99ea36f2d10","migrationVersion":{"visualization":"7.4.2"},"references":[{"id":"6b4bc2f0-7ae8-11ea-8010-f99ea36f2d10","name":"kibanaSavedObjectMeta.searchSourceJSON.index","type":"index-pattern"}],"type":"visualization","updated_at":"2020-04-13T03:50:35.691Z","version":"WzksMV0="}
{"attributes":{"description":"","kibanaSavedObjectMeta":{"searchSourceJSON":"{\"indexRefName\":\"kibanaSavedObjectMeta.searchSourceJSON.index\"}"},"title":"Users Payments Sums","uiStateJSON":"{}","version":1,"visState":"{\"title\":\"Users Payments Sums\",\"type\":\"histogram\",\"params\":{\"type\":\"histogram\",\"grid\":{\"categoryLines\":false},\"categoryAxes\":[{\"id\":\"CategoryAxis-1\",\"type\":\"category\",\"position\":\"bottom\",\"show\":true,\"style\":{},\"scale\":{\"type\":\"linear\"},\"labels\":{\"show\":true,\"filter\":true,\"truncate\":100},\"title\":{}}],\"valueAxes\":[{\"id\":\"ValueAxis-1\",\"name\":\"LeftAxis-1\",\"type\":\"value\",\"position\":\"left\",\"show\":true,\"style\":{},\"scale\":{\"type\":\"linear\",\"mode\":\"normal\"},\"labels\":{\"show\":true,\"rotate\":0,\"filter\":false,\"truncate\":100},\"title\":{\"text\":\"Sum\"}}],\"seriesParams\":[{\"show\":true,\"type\":\"histogram\",\"mode\":\"stacked\",\"data\":{\"label\":\"Sum\",\"id\":\"1\"},\"valueAxis\":\"ValueAxis-1\",\"drawLinesBetweenPoints\":true,\"lineWidth\":2,\"showCircles\":true}],\"addTooltip\":true,\"addLegend\":true,\"legendPosition\":\"right\",\"times\":[],\"addTimeMarker\":false,\"labels\":{\"show\":false},\"thresholdLine\":{\"show\":false,\"value\":10,\"width\":1,\"style\":\"full\",\"color\":\"#E7664C\"},\"dimensions\":{\"x\":null,\"y\":[{\"accessor\":0,\"format\":{\"id\":\"number\",\"params\":{\"parsedUrl\":{\"origin\":\"http://192.168.0.10:5601\",\"pathname\":\"/app/kibana\",\"basePath\":\"\"}}},\"params\":{},\"label\":\"Sum\",\"aggType\":\"sum\"}]}},\"aggs\":[{\"id\":\"1\",\"enabled\":true,\"type\":\"sum\",\"schema\":\"metric\",\"params\":{\"field\":\"money_amount\",\"customLabel\":\"Sum\"}},{\"id\":\"2\",\"enabled\":true,\"type\":\"date_histogram\",\"schema\":\"segment\",\"params\":{\"field\":\"@timestamp\",\"useNormalizedEsInterval\":true,\"scaleMetricValues\":false,\"interval\":\"auto\",\"drop_partials\":false,\"min_doc_count\":1,\"extended_bounds\":{}}}]}"},"id":"96ac5b90-7aec-11ea-8010-f99ea36f2d10","migrationVersion":{"visualization":"7.4.2"},"references":[{"id":"6b4bc2f0-7ae8-11ea-8010-f99ea36f2d10","name":"kibanaSavedObjectMeta.searchSourceJSON.index","type":"index-pattern"}],"type":"visualization","updated_at":"2020-04-13T03:50:35.691Z","version":"WzEwLDFd"}
{"attributes":{"description":"","hits":0,"kibanaSavedObjectMeta":{"searchSourceJSON":"{\"query\":{\"language\":\"kuery\",\"query\":\"\"},\"filter\":[]}"},"optionsJSON":"{\"hidePanelTitles\":false,\"useMargins\":true}","panelsJSON":"[{\"version\":\"7.6.2\",\"gridData\":{\"h\":15,\"i\":\"a3cad024-d650-47fb-b0c1-c020be7c9603\",\"w\":24,\"x\":0,\"y\":0},\"panelIndex\":\"a3cad024-d650-47fb-b0c1-c020be7c9603\",\"embeddableConfig\":{},\"panelRefName\":\"panel_0\"},{\"version\":\"7.6.2\",\"gridData\":{\"h\":15,\"i\":\"6e01e366-9fe9-4502-b4ab-00a157e405c3\",\"w\":24,\"x\":24,\"y\":0},\"panelIndex\":\"6e01e366-9fe9-4502-b4ab-00a157e405c3\",\"embeddableConfig\":{},\"panelRefName\":\"panel_1\"},{\"version\":\"7.6.2\",\"gridData\":{\"w\":24,\"h\":15,\"x\":0,\"y\":15,\"i\":\"626cc0ab-8724-4225-acb3-85c44bfd9dea\"},\"panelIndex\":\"626cc0ab-8724-4225-acb3-85c44bfd9dea\",\"embeddableConfig\":{},\"panelRefName\":\"panel_2\"},{\"version\":\"7.6.2\",\"gridData\":{\"w\":24,\"h\":15,\"x\":24,\"y\":15,\"i\":\"e7af10a6-100f-42ac-b9d6-854bc4b73013\"},\"panelIndex\":\"e7af10a6-100f-42ac-b9d6-854bc4b73013\",\"embeddableConfig\":{},\"panelRefName\":\"panel_3\"}]","timeRestore":false,"title":"Main Dashboard","version":1},"id":"8494e2e0-7ae9-11ea-8010-f99ea36f2d10","migrationVersion":{"dashboard":"7.3.0"},"references":[{"id":"4aab2440-7ae9-11ea-8010-f99ea36f2d10","name":"panel_0","type":"visualization"},{"id":"82547350-7aea-11ea-8010-f99ea36f2d10","name":"panel_1","type":"visualization"},{"id":"d1347280-7aeb-11ea-8010-f99ea36f2d10","name":"panel_2","type":"visualization"},{"id":"96ac5b90-7aec-11ea-8010-f99ea36f2d10","name":"panel_3","type":"visualization"}],"type":"dashboard","updated_at":"2020-04-13T03:50:35.691Z","version":"WzExLDFd"}
{"exportedCount":9,"missingRefCount":0,"missingReferences":[]}