{
  "name": "C# (.NET)",
  "dockerFile": "Dockerfile",

  "customizations": {
    "vscode": {
      "settings": {},
      "extensions": [
        "streetsidesoftware.code-spell-checker",
        "ms-dotnettools.csdevkit",
        "task.vscode-task",
        "redhat.vscode-yaml",
        "shd101wyy.markdown-preview-enhanced",
        "hediet.vscode-drawio",
        "GitHub.copilot"
      ]
    }
  },

  "portsAttributes": {
    "5000": {
      "label": "Hello Remote World",
      "onAutoForward": "notify"
    },
    "5001": {
      "protocol": "https"
    }
  }
}
