{
  "name": "facebook-app",
  "$schema": "../../node_modules/nx/schemas/project-schema.json",
  "sourceRoot": "apps/facebook-app/src",
  "projectType": "application",
  "targets": {
    "build": {
      "executor": "@nrwl/webpack:webpack",
      "outputs": ["{options.outputPath}"],
      "defaultConfiguration": "production",
      "options": {
        "compiler": "babel",
        "outputPath": "dist/apps/facebook-app",
        "index": "apps/facebook-app/src/index.html",
        "baseHref": "/",
        "main": "apps/facebook-app/src/main.js",
        "polyfills": "apps/facebook-app/src/polyfills.js",
        "tsConfig": "apps/facebook-app/tsconfig.app.json",
        "assets": [
          "apps/facebook-app/src/favicon.ico",
          "apps/facebook-app/src/assets"
        ],
        "styles": ["apps/facebook-app/src/styles.scss"],
        "scripts": [],
        "webpackConfig": "@nrwl/react/plugins/webpack"
      },
      "configurations": {
        "development": {
          "extractLicenses": false,
          "optimization": false,
          "sourceMap": true,
          "vendorChunk": true
        },
        "production": {
          "fileReplacements": [
            {
              "replace": "apps/facebook-app/src/environments/environment.js",
              "with": "apps/facebook-app/src/environments/environment.prod.js"
            }
          ],
          "optimization": true,
          "outputHashing": "all",
          "sourceMap": false,
          "namedChunks": false,
          "extractLicenses": true,
          "vendorChunk": false
        }
      }
    },
    "serve": {
      "executor": "@nrwl/webpack:dev-server",
      "defaultConfiguration": "development",
      "options": {
        "buildTarget": "facebook-app:build",
        "hmr": true
      },
      "configurations": {
        "development": {
          "buildTarget": "facebook-app:build:development"
        },
        "production": {
          "buildTarget": "facebook-app:build:production",
          "hmr": false
        }
      }
    },
    "lint": {
      "executor": "@nrwl/linter:eslint",
      "outputs": ["{options.outputFile}"],
      "options": {
        "lintFilePatterns": ["apps/facebook-app/**/*.{ts,tsx,js,jsx}"]
      }
    }
  },
  "tags": []
}
