"Augustus Shanahan IV 2","oreilly.branson@example.org2","0980380142","99766 Hermiston Ford Apt. 964
Rosellaland, DE 9172"
"Dr. Lauren Zemlak 3","donnelly.myron@example.com3","0905811923","508 Dickens Summit Apt. 216
Koelpinshire, NE 06369-06403"