[
  {
    "userName": "admin",
    "password": "admin",
    "role": "Admin"
  },
  {
    "userName": "user",
    "password": "user",
    "role": "User"
  },
  {
    "userName": "string",
    "password": "string"
  }
]
