{
  "version": "1.0",
  "defaultProvider": "cdnjs",
  "libraries": [
    {
      "library": "globalize@1.4.2",
      "destination": "wwwroot/lib/globalize/"
    }
  ,
{
  "provider": "jsdelivr",
  "library": "jquery-validation-globalize@0.1.1",
  "destination": "wwwroot/lib/jquery-validation-globalize/"
}
,
{
  "library": "cldrjs@0.5.1",
  "destination": "wwwroot/lib/cldrjs/"
}
]
}