:107E00001F92CDB7DEB7112484B714BE81FFEAD02C
:107E100085E08093810082E08093C00088E18093B8
:107E2000C10096E09093C20091E89093C4008093C3
:107E300060008EE080936000259A86E02CE33BEFA3
:107E400091E0309385002093840096BBB09BFECFD9
:107E50001D9AA8958150A9F7612C712C08E128E0A2
:107E6000F22EEE24E39435E0D32E41E1C42E13E04C
:107E700094D0813469F491D089839BD089818238F0
:107E8000F9F0813811F485E001C083E07FD07BC038
:107E9000823411F484E103C0853419F485E095D06F
:107EA00072C0853549F479D0B82E77D06B2C712CFF
:107EB000782A660C771C66C0863521F484E085D06C
:107EC00080E0E4CF843609F03FC067D066D0982EBA
:107ED00064D0611480E7780618F4F30117BFE895C1
:107EE000A12CBB24B39459D0F50181935F019E125C
:107EF000FACF6114F0E77F0618F0F30117BFE89599
:107F000058D007B600FCFDCFA301A0E0B1E08C91F2
:107F100012969D0121503109F901208190E0922BA8
:107F2000FA010C01E7BEE89511244E5F5F4FA038BF
:107F3000F1E0BF0761F7F301D7BEE89507B600FC93
:107F4000FDCFC7BEE8951FC0843769F426D025D081
:107F5000B82E23D02ED0F30185913F0117D0BA94CB
:107F6000B110F9CF10C0853739F423D08EE10ED08F
:107F700085E90CD08FE08ACF813521F40093600031
:107F8000F092600016D080E101D072CF9091C000D5
:107F900095FFFCCF8093C60008958091C00087FFB5
:107FA000FCCF8091C00084FD01C0A8958091C600DF
:107FB0000895F3DF803239F088E18093600088E033
:107FC00080936000FFCF84E1E1CFCF93C82FE5DF3E
:107FD000C150E9F7CF91EDCFE0E6F0E098E1908372
:107FE00080830895282EE0E6F0E088E18083108207
:067FF000EE27FF270994B3
:027FFE0000057C
:0400000300007E007B
:00000001FF
