<svg width="311" height="150" viewBox="0 0 311 150" fill="none" xmlns="http://www.w3.org/2000/svg">
<rect width="311" height="150" fill="#262745"/>
<path d="M155.375 115.594C182.092 115.594 203.75 93.9355 203.75 67.2187C203.75 40.502 182.092 18.8438 155.375 18.8438C128.658 18.8438 107 40.502 107 67.2187C107 93.9355 128.658 115.594 155.375 115.594Z" fill="url(#paint0_linear_135_132092)"/>
<path d="M142.352 58.3164L145.548 84.5021C145.72 85.9193 146.924 86.9851 148.351 86.9851H162.502C163.927 86.9851 165.128 85.9244 165.305 84.511L168.591 58.3164H142.352Z" fill="white"/>
<path d="M169.424 54.2168C169.224 52.9938 168.168 52.0967 166.929 52.0967H162.35V51.5131C162.35 49.2712 160.532 47.4531 158.29 47.4531H152.502C150.26 47.4531 148.442 49.2712 148.442 51.5131V52.0967H143.931C142.729 52.0967 141.694 52.9417 141.454 54.1191L140.895 56.8584H169.855L169.424 54.2168ZM150.862 52.0967V51.4433C150.862 50.5222 151.609 49.7749 152.53 49.7749H158.479C159.401 49.7749 160.148 50.5222 160.148 51.4433V52.0967H150.862Z" fill="white"/>
<path d="M150.026 64.3666C149.96 63.6437 149.321 63.1107 148.598 63.1762C147.875 63.2418 147.342 63.881 147.408 64.604L149.03 82.5037C149.096 83.2267 149.735 83.7596 150.458 83.6941C151.181 83.6285 151.714 82.9893 151.649 82.2663L150.026 64.3666Z" fill="#F8E9C3"/>
<path d="M163.584 64.6159C163.654 63.8934 163.125 63.2511 162.402 63.1814C161.68 63.1117 161.037 63.6409 160.968 64.3635L159.242 82.2536C159.172 82.9762 159.701 83.6184 160.424 83.6882C161.146 83.7579 161.789 83.2286 161.858 82.506L163.584 64.6159Z" fill="#F8E9C3"/>
<path d="M156.756 64.452C156.756 63.7261 156.167 63.1376 155.441 63.1376C154.715 63.1376 154.127 63.7261 154.127 64.452V82.4251C154.127 83.151 154.715 83.7395 155.441 83.7395C156.167 83.7395 156.756 83.151 156.756 82.4251V64.452Z" fill="#F8E9C3"/>
<path d="M94.8348 34.0941C96.4004 34.0941 97.6696 32.8247 97.6696 31.2589C97.6696 29.6931 96.4004 28.4238 94.8348 28.4238C93.2692 28.4238 92 29.6931 92 31.2589C92 32.8247 93.2692 34.0941 94.8348 34.0941Z" fill="#FF9D76"/>
<path d="M103.883 28.4234C107.313 28.4234 110.094 25.6423 110.094 22.2117C110.094 18.7811 107.313 16 103.883 16C100.453 16 97.6719 18.7811 97.6719 22.2117C97.6719 25.6423 100.453 28.4234 103.883 28.4234Z" fill="#FF9D76"/>
<path d="M216.835 55.6702C218.4 55.6702 219.67 54.4009 219.67 52.8351C219.67 51.2693 218.4 50 216.835 50C215.269 50 214 51.2693 214 52.8351C214 54.4009 215.269 55.6702 216.835 55.6702Z" fill="#FF9D76"/>
<path d="M220.406 62.2954C221.459 62.2954 222.312 61.4418 222.312 60.3889C222.312 59.336 221.459 58.4824 220.406 58.4824C219.353 58.4824 218.5 59.336 218.5 60.3889C218.5 61.4418 219.353 62.2954 220.406 62.2954Z" fill="#FF9D76"/>
<ellipse cx="157.064" cy="131.171" rx="70" ry="11" fill="url(#paint1_radial_135_132092)"/>
<path d="M94.8348 34.0941C96.4004 34.0941 97.6696 32.8247 97.6696 31.2589C97.6696 29.6931 96.4004 28.4238 94.8348 28.4238C93.2692 28.4238 92 29.6931 92 31.2589C92 32.8247 93.2692 34.0941 94.8348 34.0941Z" fill="#F7CE6A"/>
<path d="M103.402 28.4234C106.833 28.4234 109.613 25.6423 109.613 22.2117C109.613 18.7811 106.833 16 103.402 16C99.9721 16 97.1914 18.7811 97.1914 22.2117C97.1914 25.6423 99.9721 28.4234 103.402 28.4234Z" fill="#F7CE6A"/>
<path d="M216.835 55.6702C218.4 55.6702 219.67 54.4009 219.67 52.8351C219.67 51.2693 218.4 50 216.835 50C215.269 50 214 51.2693 214 52.8351C214 54.4009 215.269 55.6702 216.835 55.6702Z" fill="#F7CE6A"/>
<path d="M220.406 62.2954C221.459 62.2954 222.312 61.4418 222.312 60.3889C222.312 59.336 221.459 58.4824 220.406 58.4824C219.353 58.4824 218.5 59.336 218.5 60.3889C218.5 61.4418 219.353 62.2954 220.406 62.2954Z" fill="#F7CE6A"/>
<path opacity="0.4" d="M253.518 39.1321C248.906 39.1696 235.969 39.1322 233.944 39.1321C231.919 39.1321 231.244 36.0273 233.044 35.3073C232.932 32.1575 236.981 28.8953 240.469 30.9202C246.318 24.5082 252.73 30.3577 252.955 32.3826C257.185 33.8225 255.655 39.1321 253.518 39.1321Z" fill="url(#paint2_linear_135_132092)"/>
<path opacity="0.4" d="M76.5177 31.556C71.9056 31.5935 58.9692 31.556 56.9441 31.556C54.919 31.5559 54.2439 28.4511 56.0442 27.7312C55.9317 24.5814 59.9814 21.3191 63.4687 23.344C69.3183 16.932 75.7303 22.7816 75.9553 24.8064C80.185 26.2463 78.6551 31.556 76.5177 31.556Z" fill="url(#paint3_linear_135_132092)"/>
<path opacity="0.4" d="M92.7704 64.998C89.0711 65.028 78.6953 64.998 77.071 64.998C75.4468 64.9979 74.9053 62.5076 76.3492 61.9302C76.259 59.4039 79.5071 56.7873 82.3041 58.4114C86.9959 53.2685 92.1388 57.9603 92.3193 59.5844C95.7118 60.7393 94.4847 64.998 92.7704 64.998Z" fill="url(#paint4_linear_135_132092)"/>
<path opacity="0.4" d="M223.032 113.655C216.053 113.712 196.479 113.656 193.414 113.655C190.35 113.655 189.329 108.957 192.053 107.868C191.882 103.102 198.01 98.1655 203.287 101.23C212.138 91.5271 221.841 100.378 222.181 103.442C228.581 105.621 226.266 113.655 223.032 113.655Z" fill="url(#paint5_linear_135_132092)"/>
<path opacity="0.4" d="M207.151 124.001C200.173 124.058 180.598 124.001 177.534 124.001C174.469 124.001 173.448 119.303 176.172 118.214C176.002 113.448 182.129 108.511 187.406 111.575C196.258 101.873 205.96 110.724 206.3 113.788C212.701 115.967 210.386 124.001 207.151 124.001Z" fill="url(#paint6_linear_135_132092)"/>
<defs>
<linearGradient id="paint0_linear_135_132092" x1="192.466" y1="33.8251" x2="123.934" y2="89.1421" gradientUnits="userSpaceOnUse">
<stop offset="0.01" stop-color="#FABF7F"/>
<stop offset="0.97" stop-color="#F29D41"/>
</linearGradient>
<radialGradient id="paint1_radial_135_132092" cx="0" cy="0" r="1" gradientUnits="userSpaceOnUse" gradientTransform="translate(158.991 129.553) rotate(-180) scale(61.0092 10.6176)">
<stop offset="1.40963e-07" stop-color="#212245"/>
<stop offset="1" stop-color="#33345F" stop-opacity="0"/>
</radialGradient>
<linearGradient id="paint2_linear_135_132092" x1="241.852" y1="37.4802" x2="242.252" y2="25.9288" gradientUnits="userSpaceOnUse">
<stop offset="0.0684391" stop-color="#33345F" stop-opacity="0"/>
<stop offset="0.737913" stop-color="#3E4078"/>
</linearGradient>
<linearGradient id="paint3_linear_135_132092" x1="64.8524" y1="29.904" x2="65.2523" y2="18.3526" gradientUnits="userSpaceOnUse">
<stop offset="0.0684391" stop-color="#33345F" stop-opacity="0"/>
<stop offset="0.737913" stop-color="#3E4078"/>
</linearGradient>
<linearGradient id="paint4_linear_135_132092" x1="83.414" y1="63.673" x2="83.7347" y2="54.408" gradientUnits="userSpaceOnUse">
<stop offset="0.0684391" stop-color="#33345F" stop-opacity="0"/>
<stop offset="0.737913" stop-color="#3E4078"/>
</linearGradient>
<linearGradient id="paint5_linear_135_132092" x1="205.381" y1="111.156" x2="205.986" y2="93.6767" gradientUnits="userSpaceOnUse">
<stop offset="0.0684391" stop-color="#33345F" stop-opacity="0"/>
<stop offset="0.737913" stop-color="#3E4078"/>
</linearGradient>
<linearGradient id="paint6_linear_135_132092" x1="189.5" y1="121.501" x2="190.105" y2="104.022" gradientUnits="userSpaceOnUse">
<stop offset="0.0684391" stop-color="#33345F" stop-opacity="0"/>
<stop offset="0.737913" stop-color="#3E4078"/>
</linearGradient>
</defs>
</svg>
