<svg width="25" height="24" viewBox="0 0 25 24" fill="none" xmlns="http://www.w3.org/2000/svg">
<rect x="6.5" y="6" width="12" height="11" fill="white"/>
<path d="M12.5 2C10.5222 2 8.58879 2.58649 6.9443 3.6853C5.29981 4.78412 4.01809 6.3459 3.26121 8.17316C2.50433 10.0004 2.3063 12.0111 2.69215 13.9509C3.078 15.8907 4.03041 17.6725 5.42894 19.0711C6.82746 20.4696 8.60929 21.422 10.5491 21.8078C12.4889 22.1937 14.4996 21.9957 16.3268 21.2388C18.1541 20.4819 19.7159 19.2002 20.8147 17.5557C21.9135 15.9112 22.5 13.9778 22.5 12C22.4949 9.34939 21.4397 6.80881 19.5655 4.93455C17.6912 3.06028 15.1506 2.00508 12.5 2ZM17.2596 10.25L11.625 15.6346C11.4793 15.7716 11.2865 15.8474 11.0865 15.8462C10.9888 15.8476 10.8917 15.8296 10.801 15.7933C10.7102 15.757 10.6275 15.703 10.5577 15.6346L7.74039 12.9423C7.66225 12.8741 7.5987 12.7909 7.55356 12.6975C7.50842 12.6041 7.48262 12.5026 7.47772 12.399C7.47282 12.2954 7.48892 12.1919 7.52504 12.0947C7.56116 11.9975 7.61656 11.9086 7.68792 11.8334C7.75928 11.7581 7.84511 11.6981 7.94027 11.6568C8.03542 11.6156 8.13793 11.5941 8.24163 11.5935C8.34533 11.5928 8.44808 11.6132 8.5437 11.6533C8.63933 11.6935 8.72585 11.7525 8.79808 11.8269L11.0865 14.0096L16.2019 9.13461C16.3515 9.00412 16.5457 8.9365 16.744 8.94588C16.9423 8.95526 17.1292 9.04092 17.2658 9.18495C17.4024 9.32898 17.478 9.52023 17.4768 9.71872C17.4757 9.9172 17.3979 10.1076 17.2596 10.25Z" fill="#3A845D"/>
</svg>
