<svg width="48" height="48" viewBox="0 0 48 48" fill="none" xmlns="http://www.w3.org/2000/svg">
<rect width="48" height="48" rx="4" fill="#F7C245"/>
<path d="M22.992 34.08C21.792 34.296 20.49 33.4524 20.49 31.98V26.63C20.49 25.92 20.09 25.01 19.69 24.51L15.9 20.47C15.4 19.96 15 19.05 15 18.45V16.12C15 14.91 15.9 14 16.99 14H30.17C30.3964 14 30.6146 14.0393 30.8183 14.1114C31.817 14.2207 32.6009 15.0731 32.6009 16.0996V18.2996C32.6009 19.0996 32.1009 20.0996 31.6009 20.5996L27.3009 24.3996C26.7009 24.8996 26.3009 25.8996 26.3009 26.6996V30.9996C26.3009 31.5996 25.9009 32.3996 25.4009 32.6996L24.0009 33.5996C23.376 33.96 23.544 33.912 22.992 34.08Z" fill="#414143"/>
</svg>
