<svg width="20" height="20" viewBox="0 0 20 20" fill="none" xmlns="http://www.w3.org/2000/svg">
<path d="M3.72481 6.64131C3.9467 6.41942 4.29391 6.39925 4.53859 6.5808L4.60869 6.64131L10.0001 12.0324L15.3915 6.64131C15.6134 6.41942 15.9606 6.39925 16.2053 6.5808L16.2754 6.64131C16.4972 6.8632 16.5174 7.21042 16.3359 7.4551L16.2754 7.52519L10.442 13.3585C10.2201 13.5804 9.87291 13.6006 9.62824 13.419L9.55814 13.3585L3.72481 7.52519C3.48073 7.28112 3.48073 6.88539 3.72481 6.64131Z" fill="white"/>
</svg>
