<svg width="40" height="40" viewBox="0 0 40 40" fill="none" xmlns="http://www.w3.org/2000/svg">
<rect x="0.5" y="0.5" width="39" height="39" rx="19.5" fill="#F7C245"/>
<path d="M26 26.6667H14C13.7267 26.6667 13.5 26.4401 13.5 26.1667C13.5 25.8934 13.7267 25.6667 14 25.6667H26C26.2733 25.6667 26.5 25.8934 26.5 26.1667C26.5 26.4401 26.2733 26.6667 26 26.6667Z" fill="#2B2512"/>
<path d="M24.6804 14.3199C23.387 13.0266 22.1204 12.9933 20.7937 14.3199L19.987 15.1266C19.9204 15.1933 19.8937 15.2999 19.9204 15.3933C20.427 17.1599 21.8404 18.5733 23.607 19.0799C23.6337 19.0866 23.6604 19.0933 23.687 19.0933C23.7604 19.0933 23.827 19.0666 23.8804 19.0133L24.6804 18.2066C25.3404 17.5533 25.6604 16.9199 25.6604 16.2799C25.667 15.6199 25.347 14.9799 24.6804 14.3199Z" fill="#2B2512"/>
<path d="M22.4066 19.6868C22.2132 19.5934 22.0266 19.5001 21.8466 19.3934C21.6999 19.3068 21.5599 19.2134 21.4199 19.1134C21.3066 19.0401 21.1732 18.9334 21.0466 18.8268C21.0332 18.8201 20.9866 18.7801 20.9332 18.7268C20.7132 18.5401 20.4666 18.3001 20.2466 18.0334C20.2266 18.0201 20.1932 17.9734 20.1466 17.9134C20.0799 17.8334 19.9666 17.7001 19.8666 17.5468C19.7866 17.4468 19.6932 17.3001 19.6066 17.1534C19.4999 16.9734 19.4066 16.7934 19.3132 16.6068V16.6068C19.1908 16.3446 18.8467 16.2667 18.6421 16.4713L14.8932 20.2201C14.8066 20.3068 14.7266 20.4734 14.7066 20.5868L14.3466 23.1401C14.2799 23.5934 14.4066 24.0201 14.6866 24.3068C14.9266 24.5401 15.2599 24.6668 15.6199 24.6668C15.6999 24.6668 15.7799 24.6601 15.8599 24.6468L18.4199 24.2868C18.5399 24.2668 18.7066 24.1868 18.7866 24.1001L22.5416 20.3451C22.7421 20.1446 22.6668 19.7995 22.4066 19.6868V19.6868Z" fill="#2B2512"/>
<rect x="0.5" y="0.5" width="39" height="39" rx="19.5" stroke="#F7C245"/>
</svg>
