<svg xmlns="http://www.w3.org/2000/svg" width="20" height="20" viewBox="0 0 20 20">
	<path d="M2,10c0,4.4,3.6,8,8,8c4.4,0,8-3.6,8-8c0-4.4-3.6-8-8-8C5.6,2,2,5.6,2,10z" fill="#F7C245"/>
	<path d="M7,10c0,1.7,1.3,3,3,3s3-1.3,3-3s-1.3-3-3-3S7,8.3,7,10z" fill="#FFFFFF" />
</svg>