<svg width="20" height="20" viewBox="0 0 20 20" fill="none" xmlns="http://www.w3.org/2000/svg">
<path d="M17.7499 5.81669H13.0999C13.073 5.81669 13.0535 5.80688 13.0399 5.79335C13.0264 5.77982 13.0166 5.76032 13.0166 5.73336C13.0166 5.70639 13.0264 5.6869 13.0399 5.67337C13.0535 5.65984 13.073 5.65002 13.0999 5.65002H17.7499C17.7769 5.65002 17.7964 5.65984 17.8099 5.67337C17.8235 5.6869 17.8333 5.70639 17.8333 5.73336C17.8333 5.76032 17.8235 5.77982 17.8099 5.79335C17.7964 5.80688 17.7769 5.81669 17.7499 5.81669Z" fill="#F7C245" stroke="#F7C245"/>
<path d="M5.34984 5.81669H2.24984C2.22287 5.81669 2.20338 5.80688 2.18985 5.79335C2.17632 5.77982 2.1665 5.76032 2.1665 5.73336C2.1665 5.70639 2.17632 5.6869 2.18985 5.67337C2.20338 5.65984 2.22287 5.65002 2.24984 5.65002H5.34984C5.3768 5.65002 5.3963 5.65984 5.40983 5.67337C5.42335 5.6869 5.43317 5.70639 5.43317 5.73336C5.43317 5.77758 5.39502 5.81669 5.34984 5.81669Z" fill="#F7C245" stroke="#F7C245"/>
<path d="M11.2415 5.73332C11.2415 7.27511 9.99167 8.52498 8.44987 8.52498C6.90808 8.52498 5.6582 7.27511 5.6582 5.73332C5.6582 4.19152 6.90808 2.94165 8.44987 2.94165C9.99166 2.94165 11.2415 4.19152 11.2415 5.73332Z" fill="#F7C245" stroke="#F7C245"/>
<path d="M17.7502 14.8417H14.6502C14.3252 14.8417 14.0669 14.5834 14.0669 14.2584C14.0669 13.9334 14.3252 13.675 14.6502 13.675H17.7502C18.0752 13.675 18.3336 13.9334 18.3336 14.2584C18.3336 14.5834 18.0752 14.8417 17.7502 14.8417Z" fill="#F7C245"/>
<path d="M6.89984 14.8417H2.24984C1.92484 14.8417 1.6665 14.5834 1.6665 14.2584C1.6665 13.9334 1.92484 13.675 2.24984 13.675H6.89984C7.22484 13.675 7.48317 13.9334 7.48317 14.2584C7.48317 14.5834 7.2165 14.8417 6.89984 14.8417Z" fill="#F7C245"/>
<path d="M11.55 17.5583C13.3679 17.5583 14.8416 16.0846 14.8416 14.2666C14.8416 12.4487 13.3679 10.975 11.55 10.975C9.73203 10.975 8.2583 12.4487 8.2583 14.2666C8.2583 16.0846 9.73203 17.5583 11.55 17.5583Z" fill="#F7C245"/>
</svg>
