<svg width="18" height="13" viewBox="0 0 18 13" fill="none" xmlns="http://www.w3.org/2000/svg">
<path fill-rule="evenodd" clip-rule="evenodd" d="M17.7803 0.46967C18.0732 0.762563 18.0732 1.23744 17.7803 1.53033L7.28033 12.0303C7.13968 12.171 6.94891 12.25 6.75 12.25C6.55109 12.25 6.36032 12.171 6.21967 12.0303L0.96967 6.78033C0.676777 6.48744 0.676777 6.01256 0.96967 5.71967C1.26256 5.42678 1.73744 5.42678 2.03033 5.71967L6.75 10.4393L16.7197 0.46967C17.0126 0.176777 17.4874 0.176777 17.7803 0.46967Z" fill="#3E3A55"/>
</svg>
