<svg width="60" height="60" viewBox="0 0 60 60" fill="none" xmlns="http://www.w3.org/2000/svg">
    <rect width="60" height="60" rx="8" fill="#111B47" />
    <path
    d="M30.2076 48.6C27.441 48.6 24.7576 48.2333 22.1576 47.5C19.591 46.7333 17.5243 45.75 15.9576 44.55L18.7076 38.45C20.2076 39.55 21.991 40.4333 24.0576 41.1C26.1243 41.7667 28.191 42.1 30.2576 42.1C32.5576 42.1 34.2576 41.7667 35.3576 41.1C36.4576 40.4 37.0076 39.4833 37.0076 38.35C37.0076 37.5167 36.6743 36.8333 36.0076 36.3C35.3743 35.7333 34.541 35.2833 33.5076 34.95C32.5076 34.6167 31.141 34.25 29.4076 33.85C26.741 33.2167 24.5576 32.5833 22.8576 31.95C21.1576 31.3167 19.691 30.3 18.4576 28.9C17.2576 27.5 16.6576 25.6333 16.6576 23.3C16.6576 21.2667 17.2076 19.4333 18.3076 17.8C19.4076 16.1333 21.0576 14.8167 23.2576 13.85C25.491 12.8833 28.2076 12.4 31.4076 12.4C33.641 12.4 35.8243 12.6667 37.9576 13.2C40.091 13.7333 41.9576 14.5 43.5576 15.5L41.0576 21.65C37.8243 19.8167 34.591 18.9 31.3576 18.9C29.091 18.9 27.4076 19.2667 26.3076 20C25.241 20.7333 24.7076 21.7 24.7076 22.9C24.7076 24.1 25.3243 25 26.5576 25.6C27.8243 26.1667 29.741 26.7333 32.3076 27.3C34.9743 27.9333 37.1576 28.5667 38.8576 29.2C40.5576 29.8333 42.0076 30.8333 43.2076 32.2C44.441 33.5667 45.0576 35.4167 45.0576 37.75C45.0576 39.75 44.491 41.5833 43.3576 43.25C42.2576 44.8833 40.591 46.1833 38.3576 47.15C36.1243 48.1167 33.4076 48.6 30.2076 48.6Z"
    fill="white"
    />
</svg>