<svg width="220" height="41" viewBox="0 0 220 41" fill="none" xmlns="http://www.w3.org/2000/svg">
    <path
        d="M14.4674 40.6C11.7007 40.6 9.01738 40.2333 6.41738 39.5C3.85072 38.7333 1.78405 37.75 0.217383 36.55L2.96738 30.45C4.46738 31.55 6.25072 32.4333 8.31738 33.1C10.384 33.7667 12.4507 34.1 14.5174 34.1C16.8174 34.1 18.5174 33.7667 19.6174 33.1C20.7174 32.4 21.2674 31.4833 21.2674 30.35C21.2674 29.5167 20.9341 28.8333 20.2674 28.3C19.6341 27.7333 18.8007 27.2833 17.7674 26.95C16.7674 26.6167 15.4007 26.25 13.6674 25.85C11.0007 25.2167 8.81738 24.5833 7.11738 23.95C5.41738 23.3167 3.95072 22.3 2.71738 20.9C1.51738 19.5 0.917383 17.6333 0.917383 15.3C0.917383 13.2667 1.46738 11.4333 2.56738 9.8C3.66738 8.13333 5.31738 6.81666 7.51738 5.85C9.75072 4.88333 12.4674 4.4 15.6674 4.4C17.9007 4.4 20.0841 4.66667 22.2174 5.2C24.3507 5.73333 26.2174 6.5 27.8174 7.5L25.3174 13.65C22.0841 11.8167 18.8507 10.9 15.6174 10.9C13.3507 10.9 11.6674 11.2667 10.5674 12C9.50072 12.7333 8.96738 13.7 8.96738 14.9C8.96738 16.1 9.58405 17 10.8174 17.6C12.0841 18.1667 14.0007 18.7333 16.5674 19.3C19.2341 19.9333 21.4174 20.5667 23.1174 21.2C24.8174 21.8333 26.2674 22.8333 27.4674 24.2C28.7007 25.5667 29.3174 27.4167 29.3174 29.75C29.3174 31.75 28.7507 33.5833 27.6174 35.25C26.5174 36.8833 24.8507 38.1833 22.6174 39.15C20.384 40.1167 17.6674 40.6 14.4674 40.6ZM51.6521 38.7C50.8855 39.2667 49.9355 39.7 48.8021 40C47.7021 40.2667 46.5355 40.4 45.3021 40.4C42.1021 40.4 39.6188 39.5833 37.8521 37.95C36.1188 36.3167 35.2521 33.9167 35.2521 30.75V19.7H31.1021V13.7H35.2521V7.15H43.0521V13.7H49.7521V19.7H43.0521V30.65C43.0521 31.7833 43.3355 32.6667 43.9021 33.3C44.5021 33.9 45.3355 34.2 46.4021 34.2C47.6355 34.2 48.6855 33.8667 49.5521 33.2L51.6521 38.7ZM83.1307 13.1V40H75.7307V36.8C74.6973 37.9667 73.464 38.8667 72.0307 39.5C70.5973 40.1 69.0473 40.4 67.3807 40.4C63.8473 40.4 61.0473 39.3833 58.9807 37.35C56.914 35.3167 55.8807 32.3 55.8807 28.3V13.1H63.6807V27.15C63.6807 31.4833 65.4973 33.65 69.1307 33.65C70.9973 33.65 72.4973 33.05 73.6307 31.85C74.764 30.6167 75.3307 28.8 75.3307 26.4V13.1H83.1307ZM117.757 2.9V40H110.307V36.9C108.374 39.2333 105.574 40.4 101.907 40.4C99.3735 40.4 97.0735 39.8333 95.0068 38.7C92.9735 37.5667 91.3735 35.95 90.2068 33.85C89.0402 31.75 88.4568 29.3167 88.4568 26.55C88.4568 23.7833 89.0402 21.35 90.2068 19.25C91.3735 17.15 92.9735 15.5333 95.0068 14.4C97.0735 13.2667 99.3735 12.7 101.907 12.7C105.34 12.7 108.024 13.7833 109.957 15.95V2.9H117.757ZM103.257 34C105.224 34 106.857 33.3333 108.157 32C109.457 30.6333 110.107 28.8167 110.107 26.55C110.107 24.2833 109.457 22.4833 108.157 21.15C106.857 19.7833 105.224 19.1 103.257 19.1C101.257 19.1 99.6068 19.7833 98.3068 21.15C97.0068 22.4833 96.3568 24.2833 96.3568 26.55C96.3568 28.8167 97.0068 30.6333 98.3068 32C99.6068 33.3333 101.257 34 103.257 34ZM124.976 13.1H132.776V40H124.976V13.1ZM128.876 9.35C127.443 9.35 126.276 8.93333 125.376 8.1C124.476 7.26666 124.026 6.23333 124.026 5C124.026 3.76666 124.476 2.73333 125.376 1.9C126.276 1.06666 127.443 0.649997 128.876 0.649997C130.309 0.649997 131.476 1.05 132.376 1.85C133.276 2.65 133.726 3.65 133.726 4.85C133.726 6.15 133.276 7.23333 132.376 8.1C131.476 8.93333 130.309 9.35 128.876 9.35ZM167.115 13.1V40H159.715V36.8C158.682 37.9667 157.448 38.8667 156.015 39.5C154.582 40.1 153.032 40.4 151.365 40.4C147.832 40.4 145.032 39.3833 142.965 37.35C140.898 35.3167 139.865 32.3 139.865 28.3V13.1H147.665V27.15C147.665 31.4833 149.482 33.65 153.115 33.65C154.982 33.65 156.482 33.05 157.615 31.85C158.748 30.6167 159.315 28.8 159.315 26.4V13.1H167.115ZM208.791 12.7C212.158 12.7 214.825 13.7 216.791 15.7C218.791 17.6667 219.791 20.6333 219.791 24.6V40H211.991V25.8C211.991 23.6667 211.541 22.0833 210.641 21.05C209.775 19.9833 208.525 19.45 206.891 19.45C205.058 19.45 203.608 20.05 202.541 21.25C201.475 22.4167 200.941 24.1667 200.941 26.5V40H193.141V25.8C193.141 21.5667 191.441 19.45 188.041 19.45C186.241 19.45 184.808 20.05 183.741 21.25C182.675 22.4167 182.141 24.1667 182.141 26.5V40H174.341V13.1H181.791V16.2C182.791 15.0667 184.008 14.2 185.441 13.6C186.908 13 188.508 12.7 190.241 12.7C192.141 12.7 193.858 13.0833 195.391 13.85C196.925 14.5833 198.158 15.6667 199.091 17.1C200.191 15.7 201.575 14.6167 203.241 13.85C204.941 13.0833 206.791 12.7 208.791 12.7Z"
        fill="#111b47"
    />
</svg>