<svg width="100" height="70" viewBox="0 0 100 70" fill="none" xmlns="http://www.w3.org/2000/svg">
<rect x="20" width="100" height="20" fill="#111b4716"/>
<rect y="70" width="70" height="20" transform="rotate(-90 0 70)" fill="#111b4716"/>
</svg>
