{
  "type": "code",
  "modid": "commandsystem2",
  "name": "CommandSystem2",
  "author": "<insert your name here>",
  "description": "<insert your mod description here>",
  "version": "0.1.0",
  "dependency": {
    "game": ""
  }
}
