{
    "com.bitlinks.maxico.iptv.m3ulist": {
        "rate_app": {
            "package_id": "com.bitlinks.maxico.iptv.m3ulist",
            "is_rate_app": true,
            "rate_app_url": "https://play.google.com/store/apps/details?id=com.bitlinks.maxico.iptv.m3ulist",
            "rate_message": "Please"
        },
        "About_App": {
            "about_title": "Maxico",
            "is_override": false,
            "is_about_app": true,
            "about_message": "Your",
            "version_detail": "version : 1.0.0",
            "registration_detail": "Maxico"
        },
        "app_lovin": {
            "id_unit_intra": "hfghfgh",
            "is_banner_ads": false,
            "is_native_ads": false,
            "id_unit_banner": "fghfg",
            "id_unit_native": "hfghfghf",
            "is_rewared_ads": false,
            "is_unlimited_ads": false,
            "is_interstitial_ads": false,
            "rewared_ads_unit_id": "hfhfh",
            "id_unit_native_multiple": {
                "small": "",
                "manual": "fghfhfhf",
                "medium": "hfghfhfgh"
            }
        },
        "extra_url": "https://gitlab.com/bitcodingsolutions/iptv_channels/-/raw/main/Mexican%20Channels.json",
        "share_app": {
            "share_title": "Share",
            "is_share_app": false,
            "share_message": "Now"
        },
        "unity_ads": {
            "game_id": "4737797",
            "is_intra_ads": true,
            "is_banner_ads": true,
            "is_rewared_ads": true
        },
        "ad_setting": {
            "is_full_ads": true,
            "onesignal_id": "",
            "ads_loading_text": "",
            "app_version_code": "2000",
            "global_intra_interval_click": "113313",
            "interstitial_ad_time_interval": "313113",
            "seconds_require_triger_reward": "25"
        },
        "app_update": {
            "title": "544",
            "app_icon": "https://play-lh.googleusercontent.com/puoKL06VOKbYoXPB-O2JfueIgMDuy2vGWdSZ7f7XsGG9idZQ7Sr42E54Uv-M5a5fqXo=w240-h480-rw",
            "package_id": "com.bitlinks.maxico.iptv.m3ulist",
            "website_url": "https://play.google.com/store/apps/details?id=com.adult.iptv.hot.playlist",
            "default_message": "Don'tfdfdsfgdsfs",
            "is_popup_dialog": true,
            "is_update_require": true,
            "updated_version_code": "29"
        },
        "custom_ads": {
            "qureka_link": "fdgdf",
            "is_quraka_banner": true,
            "is_quraka_intera": true,
            "quraka_intra_image": [
                "http://sdfssfs",
                "https://github.com/pragneshpalsanabitcoding/image_quraka/blob/main/360X640_2.png?raw=true",
                "https://github.com/pragneshpalsanabitcoding/image_quraka/blob/main/360X640_3.png?raw=true",
                "https://github.com/pragneshpalsanabitcoding/image_quraka/blob/main/360X640_4.png?raw=true",
                "https://codebeautify.org/jsonviewer",
                "https://github.com/pragneshpalsanabitcoding/image_quraka/blob/main/360X640_6.png?raw=true"
            ],
            "quraka_banner_image": [
                "https://github.com/pragneshpalsanabitcoding/image_quraka/blob/main/2.jpg?raw=true",
                "https://github.com/pragneshpalsanabitcoding/image_quraka/blob/main/3.jpg?raw=true",
                "https://github.com/pragneshpalsanabitcoding/image_quraka/blob/main/320x50.jpg?raw=true",
                "https://github.com/pragneshpalsanabitcoding/image_quraka/blob/main/4.jpg?raw=true",
                "https://github.com/pragneshpalsanabitcoding/image_quraka/blob/main/5.jpg?raw=true",
                "https://github.com/pragneshpalsanabitcoding/image_quraka/blob/main/6.jpg?raw=true"
            ],
            "close_button_to_direct_web": true
        },
        "google_ads": {
            "is_open_ads": false,
            "is_open_ads2": false,
            "is_banner_ads": false,
            "is_native_ads": false,
            "is_banner_ads2": false,
            "is_native_ads2": false,
            "is_rewared_ads": false,
            "is_rewared_ads2": false,
            "is_interstitial_ads": false,
            "rewared_ads_unit_id": "hfhfh",
            "is_interstitial_ads2": false,
            "no_of_click_interstitial": "1",
            "banner_ad_unit_id_android": "",
            "native_ads_unit_id_android": "",
            "app_open_ad_unit_id_android": "",
            "interstitial_ad_unit_id_android": "",
            "native_video_ads_unit_id_android": ""
        },
        "exit_dialog": {
            "exit_title": "Exit",
            "exit_message": "Do",
            "is_exit_require": true
        },
        "ads_sequence": [
            "facebook_ads",
            "custom_ads"
        ],
        "error_report": {
            "email_id": "mailto:bitlinks.llc@gmail.com",
            "is_error_report_support": true
        },
        "facebook_ads": {
            "is_banner_ads": false,
            "is_native_ads": false,
            "is_rewared_ads": false,
            "is_interstitial_ads": false,
            "rewared_ads_unit_id": "33333333",
            "no_of_click_interstitial": 1,
            "banner_ad_unit_id_android": "sdfs",
            "native_ads_unit_id_android": "44444444",
            "interstitial_ad_unit_id_android": "22222222"
        },
        "more_app_url": "https://play.google.com/store/apps/developer?id=Bit+Links",
        "terms_of_use": {
            "terms_of_use": "https://pages.flycricket.io/maxico-iptv-links-m3-0/privacy.html",
            "is_terms_of_use": true,
            "is_system_browser": true
        },
        "reward_dialog": {
            "reward_message": "Watch",
            "version_detail": "version",
            "is_reward_require": true
        },
        "privacy_policy": {
            "privacy_policy": "https://pages.flycricket.io/maxico-iptv-links-m3-0/privacy.html",
            "is_privacy_policy": true,
            "is_system_browser": true
        },
        "iptv_player_url": "com.pocketiptv",
        "feedback_support": {
            "email_id": "mailto:bitlinks.llc@gmail.com",
            "email_message": "Hi,",
            "email_subject": "Feedback",
            "feedback_title": "Feedback",
            "feedback_message": "Hi,",
            "is_feedback_support": true
        }
    }
}