{
    "com.bitlinks.canada.iptv.m3ulist": {
        "rate_app": {
            "package_id": "com.bitlinks.canada.iptv.m3ulist",
            "is_rate_app": true,
            "rate_app_url": "https://play.google.com/store/apps/details?id=com.bitlinks.canada.iptv.m3ulist",
            "rate_message": "Please"
        },
        "About_App": {
            "about_title": "Canada",
            "is_override": false,
            "is_about_app": true,
            "about_message": "Your",
            "version_detail": "version : 1.0.0",
            "registration_detail": "Canada"
        },
        "app_lovin": {
            "id_unit_intra": "aeed91d4430882de",
            "is_banner_ads": true,
            "is_native_ads": false,
            "id_unit_banner": "978e1e73dc64de07",
            "id_unit_native": "",
            "is_rewared_ads": true,
            "is_unlimited_ads": true,
            "is_interstitial_ads": true,
            "rewared_ads_unit_id": "8015874ac2f4e662",
            "id_unit_native_multiple": {
                "small": "9632213c2b615176",
                "manual": "7f0bb2e2e8fc7039",
                "medium": "8e4ac4cda97b3d52"
            }
        },
        "extra_url": "https://gitlab.com/bitcodingsolutions/iptv_channels/-/raw/main/English%20Channels.json",
        "share_app": {
            "share_title": "Share",
            "is_share_app": false,
            "share_message": "Now"
        },
        "unity_ads": {
            "game_id": "4737797",
            "is_intra_ads": true,
            "is_banner_ads": true,
            "is_rewared_ads": true
        },
        "ad_setting": {
            "is_full_ads": true,
            "onesignal_id": "07de0128-c4bc-45f0-8baa-6867a262a6b7",
            "ads_loading_text": "Ads will loading...",
            "app_version_code": "5",
            "global_intra_interval_click": "1",
            "interstitial_ad_time_interval": "0",
            "seconds_require_triger_reward": ""
        },
        "app_update": {
            "title": "Enjoy",
            "app_icon": "https://play-lh.googleusercontent.com/puoKL06VOKbYoXPB-O2JfueIgMDuy2vGWdSZ7f7XsGG9idZQ7Sr42E54Uv-M5a5fqXo=w240-h480-rw",
            "package_id": "com.bitlinks.canada.iptv.m3ulist",
            "website_url": "https://play.google.com/store/apps/details?id=com.adult.iptv.hot.playlist",
            "default_message": "Don't",
            "is_popup_dialog": true,
            "is_update_require": false,
            "updated_version_code": "50"
        },
        "custom_ads": {
            "qureka_link": "https://490.go.qureka.com/intro/question",
            "is_quraka_banner": true,
            "is_quraka_intera": true,
            "quraka_intra_image": [
                "https://github.com/pragneshpalsanabitcoding/image_quraka/blob/main/360X640_1.png?raw=true",
                "https://github.com/pragneshpalsanabitcoding/image_quraka/blob/main/360X640_2.png?raw=true",
                "https://github.com/pragneshpalsanabitcoding/image_quraka/blob/main/360X640_3.png?raw=true",
                "https://github.com/pragneshpalsanabitcoding/image_quraka/blob/main/360X640_4.png?raw=true",
                "https://github.com/pragneshpalsanabitcoding/image_quraka/blob/main/360X640_5.png?raw=true",
                "https://github.com/pragneshpalsanabitcoding/image_quraka/blob/main/360X640_6.png?raw=true"
            ],
            "quraka_banner_image": [
                "https://github.com/pragneshpalsanabitcoding/image_quraka/blob/main/2.jpg?raw=true",
                "https://github.com/pragneshpalsanabitcoding/image_quraka/blob/main/3.jpg?raw=true",
                "https://github.com/pragneshpalsanabitcoding/image_quraka/blob/main/320x50.jpg?raw=true",
                "https://github.com/pragneshpalsanabitcoding/image_quraka/blob/main/4.jpg?raw=true",
                "https://github.com/pragneshpalsanabitcoding/image_quraka/blob/main/5.jpg?raw=true",
                "https://github.com/pragneshpalsanabitcoding/image_quraka/blob/main/6.jpg?raw=true"
            ],
            "close_button_to_direct_web": true
        },
        "google_ads": {
            "is_open_ads": true,
            "is_banner_ads": true,
            "is_native_ads": true,
            "is_rewared_ads": true,
            "is_interstitial_ads": true,
            "rewared_ads_unit_id": "8015874ac2f4e662",
            "no_of_click_interstitial": "1",
            "banner_ad_unit_id_android": "/6499/example/banner",
            "native_ads_unit_id_android": "/6499/example/native",
            "app_open_ad_unit_id_android": "/6499/example/app-open",
            "interstitial_ad_unit_id_android": "/6499/example/interstitial",
            "native_video_ads_unit_id_android": "/6499/example/native-video"
        },
        "exit_dialog": {
            "exit_title": "Exit",
            "exit_message": "Do",
            "is_exit_require": true
        },
        "ads_sequence": [
            "facebook_ads",
            "app_lovin"
        ],
        "error_report": {
            "email_id": "mailto:bitlinks.llc@gmail.com",
            "is_error_report_support": true
        },
        "facebook_ads": {
            "is_banner_ads": true,
            "is_native_ads": true,
            "is_rewared_ads": false,
            "is_interstitial_ads": true,
            "rewared_ads_unit_id": "381039704192311_381039737525641",
            "no_of_click_interstitial": 1,
            "banner_ad_unit_id_android": "381039704192311_381039744192307",
            "native_ads_unit_id_android": "381039704192311_381039740858974",
            "interstitial_ad_unit_id_android": "381039704192311_381039737525641"
        },
        "more_app_url": "https://play.google.com/store/apps/developer?id=Bit+Links",
        "terms_of_use": {
            "terms_of_use": "https://pages.flycricket.io/canada-iptv-links-m3/privacy.html",
            "is_terms_of_use": true,
            "is_system_browser": true
        },
        "reward_dialog": {
            "reward_message": "Watch",
            "version_detail": "version",
            "is_reward_require": true
        },
        "privacy_policy": {
            "privacy_policy": "https://pages.flycricket.io/canada-iptv-links-m3/privacy.html",
            "is_privacy_policy": true,
            "is_system_browser": true
        },
        "iptv_player_url": "com.pocketiptv",
        "feedback_support": {
            "email_id": "mailto:bitlinks.llc@gmail.com",
            "email_message": "Hi,",
            "email_subject": "Feedback",
            "feedback_title": "Feedback",
            "feedback_message": "Hi,",
            "is_feedback_support": true
        }
    }
}