[
    "Aggregate",
    "Buffer",
    "Data",
    "Debug",
    "Delay",
    "Diff",
    "Differ",
    "Filter",
    "Interval",
    "List",
    "Mixer",
    "ObjectSelector",
    "ObjectToArray",
    "Random",
    "Uniselector"
]