,Date,Daily Confirmed,Total Confirmed,Daily Recovered,Total Recovered,Daily Deceased,Total Deceased
0,30 January ,1,1,0,0,0,0
1,31 January ,0,1,0,0,0,0
2,01 February ,0,1,0,0,0,0
3,02 February ,1,2,0,0,0,0
4,03 February ,1,3,0,0,0,0
5,04 February ,0,3,0,0,0,0
6,05 February ,0,3,0,0,0,0
7,06 February ,0,3,0,0,0,0
8,07 February ,0,3,0,0,0,0
9,08 February ,0,3,0,0,0,0
10,09 February ,0,3,0,0,0,0
11,10 February ,0,3,0,0,0,0
12,11 February ,0,3,0,0,0,0
13,12 February ,0,3,0,0,0,0
14,13 February ,0,3,1,1,0,0
15,14 February ,0,3,0,1,0,0
16,15 February ,0,3,0,1,0,0
17,16 February ,0,3,1,2,0,0
18,17 February ,0,3,0,2,0,0
19,18 February ,0,3,0,2,0,0
20,19 February ,0,3,0,2,0,0
21,20 February ,0,3,1,3,0,0
22,21 February ,0,3,0,3,0,0
23,22 February ,0,3,0,3,0,0
24,23 February ,0,3,0,3,0,0
25,24 February ,0,3,0,3,0,0
26,25 February ,0,3,0,3,0,0
27,26 February ,0,3,0,3,0,0
28,27 February ,0,3,0,3,0,0
29,28 February ,0,3,0,3,0,0
30,29 February ,0,3,0,3,0,0
31,01 March ,0,3,0,3,0,0
32,02 March ,2,5,0,3,0,0
33,03 March ,1,6,0,3,0,0
34,04 March ,22,28,0,3,0,0
35,05 March ,2,30,0,3,0,0
36,06 March ,1,31,0,3,0,0
37,07 March ,3,34,0,3,0,0
38,08 March ,5,39,0,3,0,0
39,09 March ,9,48,0,3,0,0
40,10 March ,15,63,1,4,0,0
41,11 March ,8,71,0,4,0,0
42,12 March ,10,81,0,4,1,1
43,13 March ,10,91,6,10,0,1
44,14 March ,11,102,0,10,1,2
45,15 March ,10,112,3,13,0,2
46,16 March ,14,126,1,14,0,2
47,17 March ,20,146,1,15,1,3
48,18 March ,25,171,0,15,0,3
49,19 March ,27,198,5,20,1,4
50,20 March ,58,256,3,23,0,4
51,21 March ,78,334,0,23,0,4
52,22 March ,69,403,0,23,3,7
53,23 March ,94,497,2,25,2,9
54,24 March ,74,571,15,40,1,10
55,25 March ,86,657,3,43,1,11
56,26 March ,73,730,7,50,5,16
57,27 March ,153,883,25,75,3,19
58,28 March ,136,1019,10,85,5,24
59,29 March ,120,1139,17,102,3,27
60,30 March ,187,1326,35,137,14,41
61,31 March ,309,1635,13,150,6,47
62,01 April ,424,2059,19,169,6,53
63,02 April ,486,2545,22,191,16,69
64,03 April ,560,3105,39,230,14,83
65,04 April ,579,3684,56,286,13,96
66,05 April ,609,4293,43,329,22,118
67,06 April ,484,4777,65,394,16,134
68,07 April ,573,5350,75,469,27,161
69,08 April ,565,5915,96,565,20,181
70,09 April ,813,6728,70,635,46,227
71,10 April ,871,7599,151,786,22,249
72,11 April ,854,8453,186,972,41,290
73,12 April ,758,9211,114,1086,42,332
74,13 April ,1243,10454,112,1198,27,359
75,14 April ,1031,11485,167,1365,37,396
76,15 April ,886,12371,144,1509,27,423
77,16 April ,1061,13432,258,1767,26,449
78,17 April ,922,14354,273,2040,38,487
79,18 April ,1371,15725,426,2466,35,522
80,19 April ,1580,17305,388,2854,38,560
81,20 April ,1239,18544,419,3273,33,593
82,21 April ,1537,20081,703,3976,53,646
83,22 April ,1292,21373,394,4370,36,682
84,23 April ,1667,23040,642,5012,40,722
85,24 April ,1408,24448,484,5496,59,781
86,25 April ,1835,26283,442,5938,44,825
87,26 April ,1607,27890,585,6523,56,881
88,27 April ,1568,29458,580,7103,58,939
89,28 April ,1902,31360,636,7739,69,1008
90,29 April ,1705,33065,690,8429,71,1079
91,30 April ,1801,34866,630,9059,75,1154
92,01 May ,2396,37262,962,10021,77,1231
93,02 May ,2567,39829,831,10852,92,1323
