<svg
   width="77.991997mm"
   height="118.29379mm"
   viewBox="0 0 77.991997 118.29379"
   version="1.1"
   id="svg5" 
   xmlns="http://www.w3.org/2000/svg"
>
  <g
     id="layer1"
     transform="translate(-52.01163,-80.847545)">
    <path
       style="fill:#ffffff;fill-opacity:1;stroke:#000000;stroke-width:3;stroke-linecap:square;stroke-dasharray:none"
       d="m 69.222452,107.59414 9.241243,84.24812 40.693415,0.0729 8.2887,-84.34676 z"
       id="path550"
       nodetypes="ccccc" />
    <path
       style="fill:#fff493;fill-opacity:1;stroke:#000000;stroke-width:3;stroke-linecap:square;stroke-dasharray:none"
       d="m 70.578955,119.96074 7.88474,71.88152 40.693415,0.0729 7.08214,-72.06872 z"
       id="path1160"
       nodetypes="ccccc" />
    <path
       style="fill:#edbb11;fill-opacity:1;stroke:#000000;stroke-width:3;stroke-linecap:square;stroke-dasharray:none"
       d="m 126.23925,119.84644 -14.37163,0.0295 -4.52879,72.02183 11.81828,0.0174 z"
       id="path3614" />
    <path
       type="star"
       style="fill:#ffffff;fill-opacity:1;stroke:#000000;stroke-width:3;stroke-linecap:square;stroke-dasharray:none"
       id="path2102"
       flatsided="false"
       sides="5"
       cx="71.87101"
       cy="83.665115"
       r1="12.261525"
       r2="6.1307621"
       arg1="0.72975043"
       arg2="1.358069"
       rounded="0"
       randomized="0"
       d="m 81.010025,91.839674 -7.844649,-2.181992 -6.244722,5.225231 -0.348933,-8.134977 -6.899214,-4.324399 7.628996,-2.845701 1.980773,-7.897855 5.063912,6.376236 8.1234,-0.556744 -4.499327,6.786432 z"
       transform-center-x="0.79996364"
       transform-center-y="-0.38366983"
       transform="translate(9.9007963,12.480492)" />
    <path
       type="star"
       style="fill:#ffffff;fill-opacity:1;stroke:#000000;stroke-width:3;stroke-linecap:square;stroke-dasharray:none"
       id="path2098"
       flatsided="false"
       sides="5"
       cx="109.03694"
       cy="89.559219"
       r1="14.067093"
       r2="7.033546"
       arg1="1.1694157"
       arg2="1.7977342"
       rounded="0"
       randomized="0"
       d="m 114.53281,102.50829 -7.07838,-6.095865 -9.034474,2.375159 3.610174,-8.615667 -5.050714,-7.85833 9.309594,0.771095 5.91296,-7.231874 2.14346,9.092229 8.70513,3.388786 -7.98486,4.848212 z"
       transform-center-x="-0.97804533"
       transform-center-y="-0.37866924"
       transform="translate(-12.45505,12.993739)" />
    <path
       style="fill:#fce95f;fill-opacity:1;stroke:#000000;stroke-width:3;stroke-linecap:square;stroke-dasharray:none"
       d="m 111.86762,119.87595 -4.52879,72.02183 -16.630171,-0.0364 -5.25011,-71.65189 z"
       id="path2106"
       nodetypes="ccccc" />
    <path
       type="star"
       style="fill:#ffffff;fill-opacity:1;stroke:#000000;stroke-width:3;stroke-linecap:square;stroke-dasharray:none"
       id="path2044"
       flatsided="false"
       sides="5"
       cx="67.549004"
       cy="91.79187"
       r1="21.551739"
       r2="10.775869"
       arg1="0.72401317"
       arg2="1.3523317"
       rounded="0"
       randomized="0"
       d="M 83.694563,106.06767 69.884469,102.31161 58.961167,111.55867 58.265833,97.263808 46.095869,89.732631 59.476224,84.653972 62.878074,70.752387 71.842922,81.908469 86.115345,80.847994 78.275571,92.82149 Z"
       transform-center-x="1.4433975"
       transform-center-y="-0.63634121"
       transform="translate(9.2895814,19.103769)" />
    <path
       type="star"
       style="fill:#ffffff;fill-opacity:1;stroke:#000000;stroke-width:3;stroke-linecap:square;stroke-dasharray:none"
       id="path2104"
       flatsided="false"
       sides="5"
       cx="122.92751"
       cy="83.936745"
       r1="10.059653"
       r2="5.0298262"
       arg1="0.7542957"
       arg2="1.3826142"
       rounded="0"
       randomized="0"
       d="m 130.25853,90.82535 -6.39007,-1.947576 -5.22699,4.159874 -0.12239,-6.679148 -5.5715,-3.685693 6.31443,-2.180364 1.78361,-6.437758 4.02492,5.331608 6.67383,-0.29306 -3.82689,5.47548 z"
       transform-center-x="0.58153858"
       transform-center-y="-0.39057915"
       transform="translate(-4.7113499,103.03739)" />
  </g>
</svg>
