libmodal-cv:32780262
libmodal-exposure:25589331
libmodal-journal:39287991
libmodal-json:21019214
libmodal-pipe:18563590
libqrb5165-io:35146576
librc-math:13627069
libuvc:30830412
libvoxl-cci-direct:38976230
libvoxl-cutils:26978656
mavlink-camera-manager:23389217
qrb5165-dfs-server:32811436
qrb5165-imu-server:35144489
qrb5165-rangefinder-server:47852432
qrb5165-system-tweaks:35645708
qrb5165-tflite:33000854
voxl-bind-spektrum:36288887
voxl-camera-calibration:27117587
voxl-camera-server:30366899
voxl-ceres-solver:30368884
voxl-configurator:45631316
voxl-cpu-monitor:25591139
voxl-docker-support:15293174
voxl-eigen3:38787953
voxl-elrs:46176432
voxl-esc:18715407
voxl-feature-tracker:38793679
voxl-flir-server:25445646
voxl-flow-server:40934187
voxl-googletest:47093167
voxl-gphoto2-server:23286649
voxl-jpeg-turbo:29759160
voxl-lepton-server:25445646
voxl-libgphoto2:33101272
voxl-libuvc:30830412
voxl-logger:35150468
voxl-mapper:31708364
voxl-mavcam-manager:23389217
voxl-mavlink-server:31742825
voxl-mavlink:26782301
voxl-microdds-agent:50536804
voxl-modem:13513845
voxl-mongoose:29763013
voxl-mpa-to-ros:24022195
voxl-mpa-to-ros2:38182426
voxl-mpa-tools:23177176
voxl-nlopt:30368100
voxl-open-vins-server:28961019
voxl-open-vins:36148524
voxl-opencv:13273993
voxl-portal:26070048
voxl-px4-imu-server:33372141
voxl-px4-params:15079828
voxl-px4:35547874
voxl-qvio-server:21354039
voxl-remote-id:40048647
voxl-ros2-foxy:50963725
voxl-slpi-uart-bridge:43921732
voxl-stitcher:36710304
voxl-streamer:22984864
voxl-tag-detector:24706185
voxl-tflite-server:22473013
voxl-utils:12386367
voxl-uvc-server:31657716
voxl-vision-hub:13331197
voxl-voxblox:26369992
voxl-wifi-broadcast:36516581
