﻿Time (s),ESC signal (µs),Servo 1 (µs),Servo 2 (µs),Servo 3 (µs),Thrust (gf),Voltage (V),Current (A),Motor Electrical Speed (RPM),Motor Optical Speed (RPM),Electrical Power (W),Overall Efficiency (gf/W),App message,
0.8318133749993052,1000,,,,-1.4806212754597066,11.118428635814135,0.01253995433333358,0,0,0.13942175768005347,0,,
0.8748643749999347,1100,,,,3.3549870630878615,11.118818851089216,0.05495921377005113,0,0,0.6110781737258397,0,,
3.9257471249997145,1150,,,,11.05453743560331,11.120583721100884,0.10865616105460507,2313,0,1.2083186324455863,9.164292370707168,,
7.130677249999948,1200,,,,21.33974443203868,11.118536280502905,0.19550195296484543,3072,0,2.173691210690561,9.828161598984382,,
10.396423999999977,1250,,,,33.244890062198316,11.115796758043869,0.30774430143270515,3806,0,3.4208194012506388,9.721213254210815,,
13.489944249999946,1300,,,,48.280658796293274,11.111230064261246,0.4537109936690761,4511,0,5.041285943455977,9.578320342744323,,
16.637607375000048,1400,,,,81.82156997818092,11.109017582611276,0.8356815968520781,5785,0,9.283599453561681,8.81401604652323,,
19.79180325000007,1450,,,,102.33066451510238,11.111299128688396,1.0956172344105857,6424,0,12.17372786992011,8.406293575930968,,
22.863382750000017,1500,,,,124.99053456255098,11.112053659637592,1.394826183116519,7062,0,15.499383064519375,8.064332347288362,,
25.963297750000134,1550,,,,149.32252836339026,11.112496743357644,1.7589879574272078,7677,0,19.54674797702474,7.639330580537044,,
29.122143000000058,1600,,,,175.15107888993506,11.111397266528815,2.1527312224862647,8286,0,23.919851114347928,7.322473128057246,,
32.31378699999996,1650,,,,201.05762321987953,11.110985584019293,2.5911291736997604,8851,0,28.78999568246823,6.983625416742019,,
35.47226537499987,1700,,,,230.21992115826993,11.110828866360418,3.097009046744681,9437,0,34.41033788348335,6.6904831796114035,,
38.67617787500023,1750,,,,257.9227501286508,11.112038460490757,3.6312905852638346,9979,0,40.3510421333442,6.39202070888246,,
41.8614335,1800,,,,286.854551797039,11.110666768682027,4.247918441510249,10489,0,47.19720667747177,6.077801931422109,,
50.760317124999915,1850,,,,318.1127764412004,11.11004150945098,4.917887622991403,11033,0,54.6379349978576,5.822201298679519,,
59.87901074999996,1900,,,,350.4030651023638,11.107054947217563,5.684327420554078,11572,0,63.13613618109779,5.549961539577494,,
69.06136999999983,1950,,,,386.44930225892625,11.104459248873804,6.480477568326185,12016,0,71.9622029392111,5.370177659991984,,
78.40700874999993,2000,,,,419.27989634690346,11.099827720812161,7.295778771017912,12540,0,80.98188334913092,5.177447471474946,,
