﻿Time (s),ESC signal (µs),Servo 1 (µs),Servo 2 (µs),Servo 3 (µs),Thrust (gf),Voltage (V),Current (A),Motor Electrical Speed (RPM),Motor Optical Speed (RPM),Electrical Power (W),Overall Efficiency (gf/W),App message,
1.2804793999998898,1000,,,,0.3996888179193917,14.846139530493579,0.009619876684551765,0,0,0.14281758509611298,0,,
1.304826349999951,1100,,,,43.88960182554292,14.841505345507606,0.2310571992082022,1954,0,3.4292369049032083,12.804360812652341,,
5.248877099999954,1147.36842105263,,,,68.89927621595858,14.838356055859828,0.3685771548779942,2455,0,5.469080028182935,12.599852232555655,,
9.090355149999935,1194.736842105264,,,,99.11014501597678,14.834075466332013,0.5512987232990888,2927,0,8.178006405592098,12.119807497014612,,
12.950776649999936,1242.1052631578934,,,,133.7535243996458,14.830002785217102,0.7627118395219366,3376,0,11.311019232859838,11.82528917251762,,
16.812937399999964,1289.473684210523,,,,168.9809381159727,14.824347379671817,1.0195116582657877,3782,0,15.113594535763394,11.181089577473108,,
20.734951049999953,1336.8421052631593,,,,207.76542376278877,14.818849385572225,1.3169652893226387,4159,0,19.515910398973823,10.646554619170798,,
24.614915299999947,1384.2105263157873,,,,250.63201279433662,14.813055983674937,1.690131527139233,4546,0,25.03601389421869,10.011106296644606,,
28.498517049999933,1431.578947368424,,,,301.1267628194575,14.803982660432188,2.1612884405763664,4971,0,31.995671739688422,9.411755138399075,,
32.31651359999993,1478.9473684210516,,,,352.30082943474315,14.795475299250413,2.667902049942885,5346,0,39.47287283276836,8.925506264696049,,
36.25447484999996,1526.315789473682,,,,412.5072848030567,14.783601215956878,3.3088948672959066,5742,0,48.91738294826982,8.432886867787348,,
40.09550009999997,1573.684210526318,,,,473.6453711004628,14.771295483697779,4.015684642899658,6132,0,59.31686225854105,7.985224582971653,,
44.00793809999996,1621.0526315789496,,,,535.9598536248208,14.75717228663809,4.724228083374674,6497,0,69.71624573745288,7.687809807484644,,
47.89490439999995,1668.4210526315758,,,,600.3407607022185,14.741865716463188,5.544503022944319,6870,0,81.7363182295917,7.344953023519349,,
51.75884759999995,1715.7894736842127,,,,671.221222747131,14.723872599996975,6.529919364900036,7277,0,96.14570120423123,6.981327477082598,,
61.01486044999997,1763.1578947368441,,,,749.2866195941172,14.705078917596186,7.605908376914119,7656,0,111.84548573394471,6.699373824414854,,
70.62823354999996,1810.526315789474,,,,828.0435975638086,14.684699536576112,8.771937214454768,8032,0,128.81326033350058,6.428291322711025,,
80.60171424999994,1857.8947368421066,,,,906.4110009258917,14.663213851495051,10.0287292167947,8402,0,147.05340221753372,6.163863688799046,,
90.95948289999995,1905.2631578947394,,,,990.5929087965529,14.640793148225685,11.341995829523539,8745,0,166.05581574457105,5.965449218117569,,
101.73517514999999,1952.6315789473667,,,,1047.9913126136519,14.623927163380255,12.375302987102744,9011,0,180.97553355101897,5.7908159885690855,,
112.86741734999998,2000,,,,1192.4130704901827,14.580076934458937,14.916247969489126,9615,0,217.48001127342505,5.482866546056676,,
