Time (s),ESC signal (µs),Servo 1 (µs),Servo 2 (µs),Servo 3 (µs),Thrust (gf),Voltage (V),Current (A),Motor Electrical Speed (RPM),Motor Optical Speed (RPM),Electrical Power (W),Overall Efficiency (gf/W),App message
1.25737380000002,1000,,,,0.670845640602516,11.0927811899405,0.072794694307033,0,0,0.807495414322497,0,
1.28661080000001,1100,,,,6.01835400167454,11.0909384578818,0.125545226922197,0,0,1.39241369047922,0,
5.18799340000001,1194.73684210526,,,,24.6853051007783,11.0878380028206,0.247744313107662,2411,0,2.74694811551524,8.98871684410485,
8.93809320000001,1242.10526315789,,,,37.2546052031803,11.0848735606627,0.367595023476349,2985,0,4.07474506451931,9.14393504634598,
12.6983046,1289.47368421052,,,,52.3918573127539,11.0804535778063,0.528442350425207,3518,0,5.85538167453223,8.94844402017251,
16.47234635,1336.84210526316,,,,70.3166877612162,11.0739167084261,0.742265959359121,4034,0,8.21979067200708,8.55481704525305,
20.23426095,1384.21052631579,,,,90.2594809653086,11.0669277057665,1.00457539062435,4523,0,11.1175629109997,8.11880412428398,
23.9984751,1431.57894736842,,,,110.318317098004,11.0580939108345,1.32652204219921,5001,0,14.6688042685547,7.52075816711843,
27.7887166,1478.94736842105,,,,132.169151780128,11.0484377614149,1.6947632050225,5456,0,18.7244854258398,7.05870248205396,
31.5399235,1526.31578947368,,,,157.195810088041,11.0376488627784,2.12428235846346,5887,0,23.4470806028331,6.70434694338938,
35.32032055,1573.68421052632,,,,184.804338814831,11.0243201234773,2.60677037454796,6316,0,28.7378706985294,6.43074878827711,
39.1477595,1621.05263157895,,,,215.052372780849,11.0097743863805,3.11361285912111,6747,0,34.2801734152518,6.27338376516022,
42.9708703,1668.42105263158,,,,241.835786283779,10.9935257609122,3.68306484471953,7127,0,40.4898662150973,5.97275663892242,
46.8180204,1715.78947368421,,,,273.945293801128,10.9765813962738,4.3009703622804,7493,0,47.2099498830031,5.8027159743095,
56.02290605,1763.15789473684,,,,299.439192028853,10.9588562325352,4.94899607429691,7839,0,54.2353350617336,5.52108098256934,
65.5821925,1810.52631578947,,,,328.908600819495,10.9369487481127,5.72065567307901,8188,0,62.5665096787477,5.25694309867923,
75.4617182,1857.89473684211,,,,353.723997615022,10.9168132956684,6.47950188011,8488,0,70.7354951062448,5.00065020758141,
85.7411231,1905.26315789474,,,,378.979908271386,10.8942719508555,7.27257938089023,8768,0,79.2294492790658,4.7833059565954,
96.46753715,1952.63157894737,,,,405.641006359,10.870019638002,8.19122378219775,9018,0,89.0387459984707,4.55576243691169,
107.58177895,2000,,,,434.580182143415,10.8420613560621,9.21272742189546,9294,0,99.8849048611569,4.35079999907925,
