﻿Time (s),ESC signal (µs),Servo 1 (µs),Servo 2 (µs),Servo 3 (µs),Thrust (gf),Voltage (V),Current (A),Motor Electrical Speed (RPM),Motor Optical Speed (RPM),Electrical Power (W),Overall Efficiency (gf/W),App message,
0.921233875000244,1000,,,,-0.2841830730276439,11.118799114228569,0.01862040213756492,0,0,0.20703728305603059,0,,
0.9945387500000651,1100,,,,3.6359303650554406,11.118109394111737,0.049913450110067634,0,0,0.5549435555232923,0,,
4.2388638749999465,1200,,,,16.195655260714698,11.12027340013829,0.14773010107284137,2780,0,1.64279837385679,9.87139645990358,,
7.593024375000271,1250,,,,26.51248021659854,11.117897958636876,0.23484883290182984,3461,0,2.611023203536059,10.163894375910916,,
10.902410875000196,1300,,,,38.38520674905925,11.11342238997302,0.3403286753071587,4065,0,3.782213924077844,10.15029024021742,,
14.191184375000182,1350,,,,51.34442011146536,11.11019054169893,0.47872570764743705,4710,0,5.31873395605982,9.655114674083471,,
17.512769125000197,1400,,,,67.27954644923217,11.10921833353592,0.6520522520104364,5318,0,7.243791398825211,9.288317879373805,,
20.849049750000198,1450,,,,85.49320125264889,11.108526343758234,0.8602839579491064,5918,0,9.556486616077283,8.94657149770059,,
24.13431062500016,1500,,,,103.54041986737536,11.110539359182898,1.1150289020792907,6512,0,12.388572695211257,8.35796838888288,,
27.43394950000002,1550,,,,125.18778515522449,11.111529785352172,1.3911991120497078,7095,0,15.458351559971996,8.098378318468342,,
30.59370550000016,1600,,,,146.5272406502937,11.11151828471112,1.7109584672359688,7665,0,19.011347323789813,7.7074338967743214,,
33.956864000000124,1650,,,,167.8901894434389,11.11109407186569,2.05353285666148,8184,0,22.816996959270135,7.358119594048275,,
37.24355175000019,1700,,,,193.40074218309528,11.110490536288143,2.436624495206235,8714,0,27.072093771829202,7.144011720676831,,
40.55366887500026,1750,,,,218.22307928325907,11.111152444447011,2.899008010315293,9236,0,32.21131961020742,6.774749552162331,,
43.870875250000175,1800,,,,244.1182943774079,11.111480511632964,3.3842966763693716,9746,0,37.60454693786095,6.491744238788122,,
52.98850087500015,1850,,,,270.8544345672953,11.111403313142342,3.918021934985929,10248,0,43.53472272924981,6.221589489323213,,
62.31714300000016,1900,,,,298.482126874577,11.110179872736433,4.517565525256743,10754,0,50.19096545458898,5.946943091203817,,
71.86200150000045,1950,,,,325.34730582821703,11.11069166519553,5.149582546706395,11208,0,57.21541613677972,5.686355892003049,,
81.31445500000022,2000,,,,353.89673421480444,11.10930776125486,5.86267876234221,11673,0,65.13030058052057,5.4336879746667295,,
