﻿Time (s),ESC signal (µs),Servo 1 (µs),Servo 2 (µs),Servo 3 (µs),AccX (g),AccY (g),AccZ (g),Torque (N·m),Thrust (gf),Voltage (V),Current (A),Motor Electrical Speed (RPM),Motor Optical Speed (RPM),Electrical Power (W),Mechanical Power (W),Motor Efficiency (%),Propeller Mech. Efficiency (gf/W),Overall Efficiency (gf/W),Vibration (g),App message,
0.7580624999999782,1000,,,,-0.056103515625,0.03310546875,-1.003076171875,0.00014322541790915555,-0.23660024529714394,7.3985947370529175,0.05871060765348375,0,0,0.4343301341166422,0,0,0,0,0.08505859375,,
0.8059192499999714,1100,,,,-0.050439453125,0.022021484375,-0.99970703125,0.0005509084293698486,3.1498754931162827,7.39781209230423,0.08441083785146475,0,0,0.6244548469813791,0,0,0,0,0.085498046875,,
3.729547374999966,1200,,,,-0.046875,0.020751953125,-0.997802734375,0.0014793393128818932,13.913556649304729,7.3960812330245975,0.1978558462113142,4541,0,1.463357540132439,0.7034075114394716,48.11246341167825,19.820821986247942,9.515316891945941,0.0962890625,,
6.568607874999971,1250,,,,-0.052783203125,0.021630859375,-0.996826171875,0.002085133698918366,20.96440005734219,7.394408619403839,0.2897671975195408,5559,0,2.1426595333730925,1.2139342708757888,56.71559698778725,17.286017120741104,9.79201549442684,0.156640625,,
9.458861374999966,1300,,,,-0.057080078125,0.023046875,-0.996044921875,0.0027904577938224233,30.288240072633442,7.392377364635467,0.42792018204927446,6449,0,3.163349133690145,1.8845548161997268,59.59787832528788,16.082387557984287,9.57818244526443,0.4625,,
12.32384737499996,1350,,,,-0.056884765625,0.0240234375,-1.002685546875,0.003632146851799605,41.03719809071747,7.389470076560974,0.6028399467468262,7437,0,4.454662811814763,2.82880402355809,63.53077580278906,14.51351559289605,9.215367729856348,0.98935546875,,
15.20151349999997,1400,,,,-0.051904296875,0.023681640625,-0.996337890625,0.004445793143719473,50.09521458190641,7.386912071704865,0.7822404339909553,8240,0,5.778343675955643,3.836203895828727,66.39251905718449,13.061035753430863,8.670000837254728,0.62470703125,,
18.077517624999963,1450,,,,-0.054150390625,0.023876953125,-0.99755859375,0.005456088012413396,62.37643554578613,7.382733333110809,1.0667113333940506,9155,0,7.875246131743047,5.23131677199146,66.42940899072609,11.929099791962782,7.920868031123752,0.35927734375,,
20.93250962499997,1500,,,,-0.053515625,0.019384765625,-0.99619140625,0.0063583133258974175,73.66084218686122,7.378087568283081,1.3551481455564498,9892,0,9.998399457802917,6.5863563935738245,65.87648421986076,11.184622415490818,7.367581782043826,0.259326171875,,
23.83963112499996,1550,,,,-0.05126953125,0.018798828125,-0.997607421875,0.007239869191028696,84.4029987841332,7.374595284461975,1.6432293385267258,10553,0,12.118148492199143,8.000533768117773,66.02501165701722,10.551958231909182,6.965327496558007,0.2224609375,,
26.67805787499996,1600,,,,-0.054150390625,0.029736328125,-0.99921875,0.008343285470417607,96.97115369299628,7.368711614608765,2.027019113302231,11296,0,14.936517851675209,9.869376575075865,66.0777391839533,9.825998261565871,6.492385797116361,0.22392578125,,
29.571581499999972,1650,,,,-0.054248046875,0.029638671875,-0.99619140625,0.009488528150593381,110.81407856941854,7.362735092639923,2.4702712655067445,11983,0,18.187949375739837,11.906975075634467,65.46871498080218,9.307263868663137,6.092946933267966,0.19814453125,,
32.45689787499997,1700,,,,-0.047021484375,0.018994140625,-1.00283203125,0.010556652591283867,123.63189500007968,7.356134378910065,2.9175284922122957,12611,0,21.461712099082394,13.941661657154588,64.96277634479779,8.868027667007807,5.760780086689799,0.174267578125,,
35.35026637499999,1750,,,,-0.052392578125,0.024560546875,-1.00380859375,0.011552516240456074,136.22203639105248,7.348475778102875,3.405559241771698,13153,0,25.025665838490703,15.912723453509518,63.58649940359341,8.560801231571444,5.44336255192883,0.3353515625,,
38.21273112499996,1800,,,,-0.05166015625,0.02919921875,-0.999658203125,0.012500746023523468,147.95914368996984,7.3409367322921755,3.907782620191574,13702,0,28.686783152273755,17.936469273121237,62.52557829819408,8.249451728881649,5.157780620649654,0.443359375,,
46.85882937499998,1850,,,,-0.05126953125,0.0244140625,-1.003125,0.013517817095935058,160.8774947834536,7.33127076625824,4.469553458690643,14256,0,32.767509861308454,20.18113116808555,61.589583947240996,7.971953431641751,4.909685434797109,0.40712890625,,
55.63834337499999,1900,,,,-0.051220703125,0.018310546875,-0.998291015625,0.014428368013445103,171.87840801091627,7.323148608207703,5.071708023548126,14750,0,37.14086462393641,22.287116001626355,60.00668455013887,7.712325913639845,4.627751319010179,0.287548828125,,
64.55976037499997,1950,,,,-0.050927734375,0.023388671875,-1.001171875,0.015277111765827961,183.39631417148502,7.313100516796112,5.697527039051056,15213,0,41.66658090468181,24.33866660674899,58.41232196898976,7.535873774455903,4.401564031253717,0.2603515625,,
73.59893249999996,2000,,,,-0.0529296875,0.025634765625,-0.996044921875,0.016137352227163212,194.56560105764478,7.301457583904266,6.37819756269455,15570,0,46.57012741914316,26.31254663501387,56.49924839567588,7.395277146935673,4.177858575276702,0.325634765625,,
