﻿Time (s),ESC signal (µs),Servo 1 (µs),Servo 2 (µs),Servo 3 (µs),Thrust (gf),Voltage (V),Current (A),Motor Electrical Speed (RPM),Motor Optical Speed (RPM),Electrical Power (W),Overall Efficiency (gf/W),App message,
0.763123200000004,1000,,,,-0.00922602021770477,12.339081096426073,0.057386352216989185,0,0,0.7080865189464958,0,,
0.837356100000004,1100,,,,3.548912169047858,12.339960830906795,0.0438984829347629,3011,0,0.5417055339627546,6.5332120227428545,,
3.5971665000000064,1169.230769230768,,,,10.547095499055247,12.336190123944684,0.10823775323968926,5136,0,1.3352421310231108,7.907107366120037,,
6.306872500000004,1238.4615384615388,,,,20.648829184157993,12.331533790056367,0.1993456673093554,7039,0,2.458237628961233,8.406058120632268,,
9.030977800000002,1307.6923076923067,,,,33.37511968246706,12.323461387080046,0.3524618588305355,8897,0,4.343551174864804,7.68434374380348,,
11.713221500000008,1376.9230769230774,,,,49.33321222923593,12.3119712220356,0.5311571493002484,10509,0,6.539591354657589,7.544242418930331,,
14.410900800000006,1446.1538461538453,,,,68.05529235225514,12.295517091675134,0.8113915301036755,12214,0,9.976477959632458,6.821655837315305,,
17.128080200000003,1515.3846153846157,,,,85.27976169099763,12.274407575494939,1.097523133573728,13726,0,13.47144416735548,6.330596008246069,,
19.8529804,1584.6153846153848,,,,111.6393193657889,12.244855043095866,1.5438019445420934,15442,0,18.903635479043793,5.9057247529430175,,
22.549853100000004,1653.846153846155,,,,134.18080625217456,12.211623452181113,2.014091642261221,16785,0,24.59532336178958,5.455591801009843,,
25.267436200000006,1723.0769230769222,,,,156.43031570341748,12.175090091706126,2.4911498053040457,18054,0,30.32998101211162,5.157637684753544,,
28.018142300000008,1792.307692307692,,,,179.2591814859322,12.132344536613207,3.059784336987375,19340,0,37.12237888215083,4.828863678436707,,
30.753982099999998,1861.5384615384633,,,,205.04059104045095,12.08239865190091,3.7537934199245235,20463,0,45.35482983835738,4.520821853496326,,
41.39926350000002,1930.769230769233,,,,233.55187413876118,12.042497671758618,4.565701614317967,21694,0,54.982488124581735,4.247761991979187,,
52.2473615,2000,,,,264.1142878942617,11.97381397637105,5.744912070881863,22718,0,68.7886351904926,3.8396600861558636,,
