﻿Time (s),ESC signal (µs),Servo 1 (µs),Servo 2 (µs),Servo 3 (µs),Thrust (gf),Voltage (V),Current (A),Motor Electrical Speed (RPM),Motor Optical Speed (RPM),Electrical Power (W),Overall Efficiency (gf/W),App message,
1.7710701666667128,1010,,,,1.5641471512927614,11.13467682593111,0.05240631336550363,0,0,0.5835250189244114,0,,
0.8125866666667163,1035.3846153846162,,,,3.691591946868471,11.13641994146649,0.06473536919134944,8,0,0.7209194456226219,1.6841678399657798,,
3.8407171666667095,1060.7692307692307,,,,5.636355895757831,11.136086560050675,0.07931094937850519,1772,0,0.8832129423117401,6.4350839223376,,
6.7927763333334035,1086.1538461538466,,,,7.766566781615118,11.136048974036258,0.09491343744041472,2104,0,1.0569617757808651,7.3765743833435735,,
9.794437333333354,1111.5384615384612,,,,11.222737457694254,11.136415909047821,0.1165021123576857,2435,0,1.2974137388257476,8.663531842221019,,
12.677656833333412,1136.9230769230774,,,,15.708578784916751,11.135540466215106,0.14617989158575098,2768,0,1.627790098966146,9.655625859192332,,
15.690505500000048,1162.307692307692,,,,19.56436251216777,11.13530186868848,0.17763316825382203,3095,0,1.9779986958814915,9.891621400893484,,
18.579857000000025,1187.692307692308,,,,25.61536326452057,11.135852398293926,0.22106802035633735,3429,0,2.461782395326524,10.406891601568383,,
21.548516833333395,1213.0769230769226,,,,32.411682200330894,11.134408788432781,0.26561515518645706,3759,0,2.957466379848063,10.962765881570194,,
24.682545666666677,1238.4615384615388,,,,36.95147828788134,11.135145339898465,0.3154764579462702,4083,0,3.512874210501395,10.52190726556028,,
27.710138333333383,1263.8461538461536,,,,45.30393842436238,11.134556462043186,0.378800045441408,4421,0,4.21777153627021,10.743403328858534,,
30.789988000000015,1289.2307692307688,,,,52.599076588101475,11.132976322646527,0.44660250278546865,4739,0,4.972014363070227,10.580107042366441,,
33.89128750000001,1314.6153846153836,,,,60.479623747683824,11.132329230779222,0.5289319259178422,5075,0,5.888244460741076,10.272364012219775,,
36.95574433333336,1340,,,,69.62887998837435,11.132291042824768,0.6180889417896854,5410,0,6.8807457571203265,10.119778243362731,,
39.949773666666744,1365.3846153846164,,,,78.6250907207094,11.130774533817592,0.7093263610680265,5729,0,7.895352699489838,9.959095325030946,,
43.00427816666672,1390.7692307692314,,,,88.39947895679548,11.130662770424411,0.8116342642824829,6074,0,9.034025970540933,9.785928720979628,,
45.896314833333385,1416.1538461538462,,,,98.79864313355347,11.128793519875307,0.9306696920506902,6389,0,10.357230866957021,9.539698771856346,,
48.92980933333332,1441.5384615384612,,,,109.97286017674475,11.128567166165961,1.079894825009932,6731,0,12.017679835872643,9.151284805100067,,
52.00882050000002,1466.9230769230774,,,,122.29464886683438,11.12721908219233,1.2181283234604214,7056,0,13.554379191481972,9.022902166992719,,
54.869132000000036,1492.3076923076926,,,,134.47461457899203,11.125308088955308,1.377674833257617,7384,0,15.327057178850744,8.773753537738964,,
57.890010166666734,1517.6923076923074,,,,147.0982911233197,11.125059339663105,1.5649491642563986,7724,0,17.41015206498163,8.449142281657439,,
60.97882100000002,1543.0769230769224,,,,159.90412055923184,11.123976980684983,1.7594908429563236,8043,0,19.572533705262092,8.16996973672495,,
63.88234650000003,1568.4615384615388,,,,170.16453363669584,11.124281853797832,1.9499819991848233,8352,0,21.69215443343546,7.844768943217872,,
66.81386750000006,1593.846153846154,,,,184.3915604621341,11.123202192764317,2.182647784118002,8707,0,24.27803317721604,7.595115937781236,,
69.8132383333334,1619.2307692307684,,,,198.59539555325915,11.123078168041893,2.4328282259700216,9018,0,27.06053597912892,7.339145586406954,,
72.96132933333337,1644.6153846153836,,,,213.25567969156558,11.123244509998164,2.708880651713478,9372,0,30.13154164659669,7.077668520286313,,
75.94419566666672,1670,,,,230.22220963526223,11.122526571925858,3.006512875082962,9690,0,33.440010882644444,6.885019418326451,,
78.87014083333337,1695.3846153846164,,,,242.70128441182135,11.123301366598856,3.317220889980573,10015,0,36.898447440443796,6.5776683767102515,,
81.91347033333338,1720.7692307692319,,,,260.6595013364333,11.124109928497855,3.6551644998268435,10339,0,40.660451726476055,6.41069434803924,,
84.89791716666673,1746.1538461538455,,,,276.1227864034629,11.122568071879998,4.002764821181636,10679,0,44.521016687264016,6.202167345524654,,
87.97553833333339,1771.5384615384612,,,,295.2597618423379,11.121510008877017,4.384524137398556,11017,0,48.76252216473367,6.0553007104271535,,
91.13073750000002,1796.9230769230776,,,,312.22696662398306,11.119414151910116,4.7963680844204175,11335,0,53.3327991605862,5.854398944196789,,
94.13036533333334,1822.307692307693,,,,332.60722584292716,11.116448947010701,5.262823264521169,11658,0,58.50390394660363,5.685262767852919,,
102.11725233333335,1847.692307692307,,,,356.8931064731863,11.110397859027524,5.799805566292794,12001,0,64.43814944808805,5.538612327933078,,
110.19161816666671,1873.0769230769224,,,,378.18074398201554,11.106456722254997,6.352956958611232,12334,0,70.55883942670206,5.359818842296802,,
118.20390400000007,1898.4615384615388,,,,392.96381030483144,11.102199262183392,6.810009704512444,12622,0,75.60608607486496,5.197518414772309,,
126.27924750000004,1923.8461538461545,,,,392.1523543846677,11.102022931026847,6.798801562610379,12629,0,75.48044846354902,5.195423069544429,,
134.5163583333334,1949.230769230768,,,,390.32809268005286,11.102486551205471,6.7756441987357166,12633,0,75.22649595169858,5.1887036782306835,,
142.81305050000006,1974.6153846153834,,,,390.87834109637623,11.102172623503867,6.774840696079183,12629,0,75.21545133386009,5.196789046122022,,
151.10474900000006,2000,,,,389.2325665703418,11.102074636243492,6.7557286115146455,12621,0,75.00260414565497,5.189597923912812,,
