﻿Time (s),ESC signal (µs),Servo 1 (µs),Servo 2 (µs),Servo 3 (µs),AccX (g),AccY (g),AccZ (g),Torque (N·m),Thrust (gf),Voltage (V),Current (A),Motor Electrical Speed (RPM),Motor Optical Speed (RPM),Electrical Power (W),Mechanical Power (W),Motor Efficiency (%),Propeller Mech. Efficiency (gf/W),Overall Efficiency (gf/W),Vibration (g),App message,
0.49000387500000003,1000,,,,-0.062158203125,0.042041015625,-1.00283203125,0.0001460565653175861,-0.059609329786612715,7.407596671581269,0.005134025431470945,0,0,0.048152893224809507,0,0,0,0,0.068359375,,
0.492903750000001,1100,,,,-0.057763671875,0.031005859375,-0.994921875,0.00040433920443387,3.0566572689189404,7.40685943365097,0.042430099286139014,0,0,0.3142744621195446,0,0,0,0,0.074462890625,,
2.568721250000003,1150,,,,-0.04775390625,0.017919921875,-0.999951171875,0.0008539202036511419,8.046277270724152,7.406175100803376,0.09501227363944054,3441,0,0.7036802758015898,0.3077589196661962,44.01754247020604,26.382604430701257,11.523082638653415,0.100830078125,,
4.643453750000004,1200,,,,-0.04638671875,0.021044921875,-0.995458984375,0.0014775947321177092,14.559001396388505,7.404457974433899,0.1678064253181219,4539,0,1.2425160138458893,0.702439327722763,56.70821372165892,20.812846649508657,11.747298652352299,0.09345703125,,
6.718733750000003,1250,,,,-0.0466796875,0.014013671875,-0.9916015625,0.002127130837922231,22.15917236106465,7.402626585960388,0.27463863268494604,5529,0,2.0330471721120804,1.2316956353184316,60.62775228398876,18.007408623705366,10.90556879643127,0.12197265625,,
8.794929500000006,1300,,,,-0.0515625,0.02177734375,-0.994189453125,0.0028029220367134762,30.427300191671584,7.400916874408722,0.4169479623436928,6436,0,3.0857960035019505,1.8890005766802314,61.26106900398895,16.127388969294753,9.867433203624135,0.200439453125,,
10.869128875000005,1350,,,,-0.048193359375,0.02197265625,-0.997900390625,0.0034456840578715926,40.194129858821405,7.398165917396545,0.579684479534626,7312,0,4.288594278736334,2.63849597118071,61.549438686467894,15.239346008272403,9.376234219644786,0.378857421875,,
12.943944625000004,1400,,,,-0.052294921875,0.0234375,-0.98916015625,0.004299541405085339,50.305410872716266,7.394915902614594,0.7796819731593132,8099,0,5.765686769627819,3.646340399708395,63.25029258593645,13.80866871657888,8.725847417643285,0.369091796875,,
15.019288750000007,1450,,,,-0.050732421875,0.020751953125,-0.995068359375,0.005292971822616432,61.79149211810368,7.391533088684082,1.0396833717823029,8984,0,7.68486231078065,4.979621550933637,64.80329831178464,12.41046376844677,8.041390589794805,0.214208984375,,
17.094394375,1500,,,,-0.056103515625,0.035107421875,-0.99404296875,0.006290223100640592,73.33596151701947,7.387157618999481,1.3269255131483078,9732,0,9.802196926459342,6.410974190313089,65.41182464126032,11.443465101865023,7.48233959259618,0.165185546875,,
19.169350875000013,1550,,,,-0.051318359375,0.019580078125,-0.99052734375,0.007353875626528225,85.77767158853794,7.381821942329407,1.6665664881467819,10492,0,12.30229325931808,8.079604471792484,65.69347378848488,10.617761323955431,6.9740542456676415,0.13994140625,,
21.244926250000006,1600,,,,-0.044189453125,0.02861328125,-0.999169921875,0.008470313277866903,99.66304030412596,7.376027071475983,2.1013998448848725,11207,0,15.499987290109559,9.940234560937315,64.13802564040817,10.031634061556685,6.430578406447483,0.118798828125,,
23.295811250000007,1650,,,,-0.0513671875,0.0220703125,-0.997412109375,0.00949780980317285,112.26631199460554,7.369739902019501,2.52010138630867,11928,0,18.57248388205577,11.86385573040587,63.88196911803948,9.463727040109191,6.044994513430541,0.11357421875,,
25.370402625000004,1700,,,,-0.0482421875,0.02578125,-1.002001953125,0.010611865126804359,125.68175084818658,7.363446152210235,2.9761456191539764,12606,0,21.91466981748219,14.00833951710857,63.927659286037205,8.972805375033046,5.735455669282578,0.1287109375,,
27.446715125000008,1750,,,,-0.05341796875,0.01962890625,-0.99775390625,0.011754968646263516,138.85175982117732,7.3562819480896,3.463941514492035,13212,0,25.48173192161361,16.26367581961049,63.826129694793735,8.537836284791732,5.449193053554767,0.157666015625,,
29.520202500000018,1800,,,,-0.05126953125,0.0259765625,-1.004150390625,0.012727250866324799,151.53610699627805,7.348531687259674,3.981272614002228,13795,0,29.2565034942837,18.385753320060758,62.844617798739684,8.242302478776368,5.179685641129511,0.244482421875,,
37.371254750000006,1850,,,,-0.053515625,0.020654296875,-1.002880859375,0.013957719141028113,167.23037224638026,7.339205956459045,4.562339389324189,14405,0,33.483943927914375,21.05433766844511,62.879480649910235,7.94299914477717,4.994374470234262,0.324267578125,,
45.34682374999999,1900,,,,-0.0521484375,0.022509765625,-0.99775390625,0.014980535094051228,180.32360639896365,7.329455578327179,5.150543701648712,14937,0,37.75067477702995,23.432833043855517,62.07469318806268,7.695604553881458,4.776820674779287,0.23544921875,,
53.44673500000001,1950,,,,-0.052001953125,0.01953125,-0.992919921875,0.01607091306695411,193.86785280047573,7.319974040985107,5.7871675252914425,15414,0,42.361911033433216,25.940077002325086,61.234678779595434,7.4738322421349626,4.576475602309061,0.200146484375,,
61.673513375000006,2000,,,,-0.051513671875,0.029931640625,-0.997314453125,0.017094677044110204,206.77767689799995,7.307558596134186,6.494236195087433,15890,0,47.456984220220846,28.44584854442071,59.94105656000416,7.269389922554018,4.357206080661168,0.22080078125,,
