﻿Time (s),ESC signal (µs),Servo 1 (µs),Servo 2 (µs),Servo 3 (µs),AccX (g),AccY (g),AccZ (g),Torque (N·m),Thrust (gf),Voltage (V),Current (A),Motor Electrical Speed (RPM),Motor Optical Speed (RPM),Electrical Power (W),Mechanical Power (W),Motor Efficiency (%),Propeller Mech. Efficiency (gf/W),Overall Efficiency (gf/W),Vibration (g),App message,
0.7722605000000126,1000,,,,-0.05849609375,0.0353515625,-0.998974609375,-0.000010918186826718361,-0.005049298354597744,7.410526382923126,0.05710983239114285,0,0,0.4231552704813691,0,0,0,0,0.07978515625,,
0.7837693750000152,1100,,,,-0.049853515625,0.022900390625,-1.00048828125,0.00031582059826765804,3.3263513908135685,7.410217297077179,0.07738906294107437,0,0,0.5734711646662686,0,0,0,0,0.08681640625,,
3.6963451250000277,1200,,,,-0.04609375,0.017919921875,-0.99560546875,0.0013074766414170028,14.227090998869082,7.408329033851624,0.1885244779288769,4585,0,1.3966510145740845,0.6277314856927018,45.03280467185471,22.721453768805958,10.204580553525565,0.096630859375,,
6.47632950000002,1250,,,,-0.050537109375,0.0220703125,-0.997021484375,0.0019226367254640171,21.527702117944383,7.406447923183441,0.28458201736211775,5608,0,2.107740398128308,1.129100343642826,53.60170083720196,19.088000140560037,10.217864672248043,0.155712890625,,
9.252825125000015,1300,,,,-0.0591796875,0.025,-0.998583984375,0.0026553404843119464,30.729705908900264,7.404585981369019,0.43394084349274636,6614,0,3.2131502172733675,1.8390958347224147,57.26841944705156,16.72059338404426,9.568247667515559,0.48759765625,,
12.090947000000018,1350,,,,-0.052294921875,0.025830078125,-0.995361328125,0.0034162895996839573,39.528456061547274,7.401896452903747,0.5822047099471093,7417,0,4.309417373208352,2.653518268242487,61.581181310479465,14.900533603749594,9.173501486466522,0.880419921875,,
14.947812000000022,1400,,,,-0.0546875,0.021826171875,-0.9990234375,0.004376127626576411,50.75423562330429,7.398707532882691,0.8015060484409332,8349,0,5.930108752506111,3.8258619820038517,64.52240124237422,13.27099053925361,8.55978257503516,0.543798828125,,
17.812177000000013,1450,,,,-0.05615234375,0.025,-0.993896484375,0.005311058315360592,61.59256781510329,7.394989061355591,1.0644002079963684,9153,0,7.871227450637624,5.090776784159845,64.6871005123874,12.100473222340907,7.826608040522913,0.33671875,,
20.67742937500002,1500,,,,-0.052490234375,0.020849609375,-0.996826171875,0.006076770626702878,71.62546524160706,7.391174471378326,1.315712371468544,9812,0,9.724660238420551,6.243716630027093,64.20798080334461,11.474964636918244,7.365742614076317,0.250830078125,,
23.525474750000022,1550,,,,-0.0529296875,0.02412109375,-0.99921875,0.00698121972211025,83.4879077003127,7.386268222332001,1.6449082255363465,10568,0,12.149729447355593,7.725657073159811,63.58983586058442,10.808256504687707,6.8719325036375345,0.21396484375,,
26.361679625000033,1600,,,,-0.05390625,0.0064453125,-0.993505859375,0.008179036553448853,97.46631942785237,7.379988062381744,2.0692572832107543,11319,0,15.271089978405419,9.694861293023992,63.48797920189031,10.05570196628236,6.382598861825089,0.21337890625,,
29.205761125000038,1650,,,,-0.0544921875,0.0248046875,-0.99951171875,0.009274117403266639,110.36829083109008,7.3744808554649355,2.4891500532627107,11991,0,18.35618654558768,11.645105441513632,63.44105002288204,9.478459555375972,6.012752409586148,0.171875,,
32.07782512500003,1700,,,,-0.05888671875,0.0298828125,-1.000634765625,0.010126238284791237,121.96974137610638,7.3682685732841495,2.918478322029114,12589,0,21.504122442945967,13.34919556481536,62.07813337137982,9.137401053012448,5.6720424492711246,0.183642578125,,
34.95552675000001,1750,,,,-0.05458984375,0.029248046875,-1.006787109375,0.011175477386691793,134.31339099409055,7.361096215248108,3.3905586183071135,13159,0,24.95822201852483,15.399871171913883,61.70463731909213,8.72218270994797,5.381688374725214,0.32939453125,,
37.88935725,1800,,,,-0.048828125,0.020703125,-1.005126953125,0.012136665422636831,146.42786830410475,7.353516042232513,3.9120116591453553,13715,0,28.767038592450216,17.431473144413403,60.59568771691876,8.400418355358669,5.090177080676749,0.42880859375,,
46.562603875000036,1850,,,,-0.04892578125,0.026806640625,-1.000927734375,0.013307835156481887,160.0718794964507,7.34535014629364,4.480286073684693,14166,0,32.90927228617154,19.742538277511905,59.99152774297174,8.111360543300352,4.864092132340218,0.41953125,,
55.38587950000002,1900,,,,-0.051611328125,0.02373046875,-0.99814453125,0.014288452521838468,171.7763389135779,7.3353420972824095,5.068963074684143,14760,0,37.182571499424135,22.085395095692807,59.39725396999607,7.778166683939181,4.619856744914054,0.283740234375,,
64.33810075000001,1950,,,,-0.05068359375,0.023095703125,-0.996484375,0.015039991867760843,183.1614448107973,7.3261166453361515,5.679787945747376,15219,0,41.610765158652455,23.970031766259506,57.60554848232865,7.6425375685107415,4.401877524595962,0.25517578125,,
73.33996225000004,2000,,,,-0.048828125,0.02578125,-0.997802734375,0.01601717048285776,193.8059869493424,7.316187191009521,6.337904560565948,15676,0,46.369275623383864,26.294630886394522,56.70560831775454,7.370946959015802,4.1796012350779215,0.355322265625,,
