﻿Time (s),ESC signal (µs),Servo 1 (µs),Servo 2 (µs),Servo 3 (µs),AccX (g),AccY (g),AccZ (g),Torque (gf·m),Thrust (gf),Voltage (V),Current (A),Motor Electrical Speed (RPM),Motor Optical Speed (RPM),Electrical Power (W),Mechanical Power (W),Motor Efficiency (%),Propeller Mech. Efficiency (gf/W),Overall Efficiency (gf/W),Vibration (g),App message,
0.5588110000000627,1000,,,,-0.0625,0.03857421875,-0.997216796875,-0.0023939607963321856,-0.3118183896210434,7.859692251682281,0.02319873349741103,0,0,0.18233477196114167,0,0,0,0,0.06552734375,,
0.5580993750000257,1100,,,,-0.053759765625,0.021044921875,-0.9947265625,0.026733475267854915,3.1515100373637313,7.857914721965789,0.06422102611511943,0,0,0.5046434080662994,0,0,0,0,0.0849609375,,
2.842090750000009,1200,,,,-0.0583984375,0.025927734375,-0.998876953125,0.10061487298908459,13.925605798748567,7.850626349449158,0.2082967193052173,4702,0,1.6352580287036784,0.48589900289437116,29.734481900924628,29.05898850390252,8.522026655682257,0.3267578125,,
5.094985750000033,1250,,,,-0.05810546875,0.0236328125,-0.996826171875,0.15867229448848116,20.41244304113856,7.844083249568939,0.3188617375865578,5676,0,2.5011764604743045,0.9248561922941132,36.98887695570955,22.156178576279945,8.16412823174197,0.757666015625,,
7.326290375000006,1300,,,,-0.059716796875,0.02138671875,-0.997021484375,0.2361149389219896,28.05914749167381,7.836062407493591,0.47211079869419337,6577,0,3.6994911596103157,1.5946902856581606,43.11180206869145,17.62732397356205,7.5860725978660355,0.61279296875,,
9.615056249999988,1350,,,,-0.06044921875,0.019775390625,-0.9962890625,0.30991248927872717,37.5326585501847,7.824068915843964,0.6602799487486485,7487,0,5.166075755589373,2.3827675787192497,46.12263005311294,15.768858233927308,7.265618309825072,0.553369140625,,
11.844758499999985,1400,,,,-0.057421875,0.026513671875,-1.005078125,0.3902042071729575,47.480671906276626,7.808409070968628,0.8824447137489919,8345,0,6.8904886548059,3.3439805992658265,48.54035570445525,14.205624238135226,6.891912654693551,1.257080078125,,
14.074266250000003,1450,,,,-0.056884765625,0.027783203125,-0.975927734375,0.48583004840996086,58.61681560176117,7.791197240352631,1.1464621317759163,9170,0,8.932313331677168,4.574874290699799,51.22301964051119,12.816294223079627,6.562891135048289,0.812890625,,
16.31904350000001,1500,,,,-0.053955078125,0.019384765625,-0.995458984375,0.5810507226352479,69.5231050563874,7.771310698986054,1.4352373463287955,9938,0,11.153672108766115,5.930250899585111,53.17207235006951,11.726777426461817,6.233558618821407,0.37763671875,,
18.64195025000002,1550,,,,-0.055029296875,0.0212890625,-0.99921875,0.6595702194904697,79.97864242973205,7.747599649429321,1.7723560285940774,10684,0,13.731508542000693,7.236593871431536,52.70348927047193,11.055756831435078,5.82486231099077,0.247021484375,,
20.909165375000015,1600,,,,-0.061328125,0.0255859375,-0.994677734375,0.7477107723115616,91.98712991427065,7.7169166803359985,2.179519854225219,11424,0,16.819164822563938,8.772338117179777,52.15998322312714,10.487436718888809,5.469849853039883,0.162158203125,,
23.221779750000003,1650,,,,-0.059521484375,0.02568359375,-0.99580078125,0.8333305509878663,103.44715670336102,7.68569655418396,2.5870547813549645,12084,0,19.88332130428278,10.341174537198217,52.01079380232869,10.004433204019739,5.202856833068772,0.098876953125,,
25.527470625000003,1700,,,,-0.059716796875,0.019775390625,-0.9953125,0.9000359808392671,115.56083516164246,7.652592790126801,3.0431435567513114,12726,0,23.28791786801211,11.7623715878849,50.51224147012086,9.826141628646079,4.962625407680763,0.126416015625,,
27.808768625000035,1750,,,,-0.05703125,0.026220703125,-0.998291015625,0.9683765619205978,126.62537037946936,7.618453395366669,3.5209077281132344,13316,0,26.82386420268258,13.242867015105748,49.37276537034769,9.56259761105126,4.72078498482718,0.18271484375,,
30.071873250000046,1800,,,,-0.051171875,0.021630859375,-1.005224609375,1.0418269981996031,137.47730724779478,7.580217325687409,4.033860598243773,13839,0,30.577529901862686,14.80691296344061,48.42475073641516,9.28540046919899,4.496074893055219,0.364697265625,,
38.137386,1850,,,,-0.05849609375,0.023486328125,-0.993701171875,1.198575758880429,150.4492780404229,7.5494174599647526,4.642306981720031,14390,0,35.046733199820025,17.711910472097735,50.5388749702943,8.494672949303908,4.292861950196392,0.2662109375,,
46.356794625000006,1900,,,,-0.058984375,0.022998046875,-1.00029296875,1.2617577176956414,161.48290646676676,7.513091135025024,5.206357238925994,14846,0,39.115872508782715,19.236476975614455,49.17745832198294,8.396561371498121,4.128354083395607,0.391259765625,,
54.65029687500002,1950,,,,-0.059912109375,0.0212890625,-1.002392578125,1.292539680492866,171.66208254201555,7.473238527774811,5.79079205814749,15336,0,43.276006608933365,20.356417810775305,47.038457619285666,8.435773355890817,3.9667597305510416,0.340673828125,,
63.071917625000026,2000,,,,-0.055224609375,0.019921875,-0.99267578125,1.3504994738576899,181.16964608065354,7.427670884132385,6.4303267580643295,15851,0,47.762415969445286,21.98337963774167,46.02628716566396,8.241921307576611,3.7931716121504997,0.2578125,,
