﻿Time (s),ESC signal (µs),Servo 1 (µs),Servo 2 (µs),Servo 3 (µs),AccX (g),AccY (g),AccZ (g),Torque (gf·m),Thrust (gf),Voltage (V),Current (A),Motor Electrical Speed (RPM),Motor Optical Speed (RPM),Electrical Power (W),Mechanical Power (W),Motor Efficiency (%),Propeller Mech. Efficiency (gf/W),Overall Efficiency (gf/W),Vibration (g),App message,
0.5182978750001231,1000,,,,-0.0625,0.03798828125,-0.9853515625,0.01674701093263641,0.5287106842326763,7.849686884880066,-0.0002624432020820682,0,0,0.04159923805491765,0,0,0,0,0.0609375,,
0.515298124999943,1100,,,,-0.051220703125,0.0224609375,-0.99951171875,0.08206607466299273,4.004349488678726,7.847389352321625,0.03902471551671626,0,0,0.30624223443683973,0,0,0,0,0.08427734375,,
2.6639632499999717,1150,,,,-0.056591796875,0.026806640625,-0.997509765625,0.12468679465418843,8.642157354929807,7.844207310676575,0.08505703408271068,3554,0,0.6672025188236551,0.4550197576569205,68.7294352454852,19.083162574204948,13.051245966817588,0.081787109375,,
4.794771499999955,1200,,,,-0.05400390625,0.0212890625,-0.993359375,0.176930819191478,14.805960679426018,7.83954963684082,0.16910426702350384,4660,0,1.3257010715011615,0.8466908468720709,63.937711475691195,17.541774223882562,11.184252133903522,0.111376953125,,
6.94588674999993,1250,,,,-0.053662109375,0.01962890625,-0.99287109375,0.23509165860705009,21.954455341902715,7.8321027755737305,0.2735039328411221,5632,0,2.142110537945116,1.3597148534737695,63.50798878265842,16.160724828760745,10.254603276668641,0.17744140625,,
9.083694999999924,1300,,,,-0.057958984375,0.022265625,-0.99462890625,0.31255267437540607,29.544297064095137,7.823186612129211,0.42416614715009915,6542,0,3.3183286553283167,2.099705815365584,63.31574918638229,14.086438930153909,8.905456640679095,0.31953125,,
11.222819499999968,1350,,,,-0.05771484375,0.027880859375,-0.99423828125,0.38836175893425146,38.43016784839171,7.809769189357757,0.6101804164424541,7460,0,4.7653638322071625,2.975302095233303,62.48022365387607,12.925104446704191,8.069335765281318,0.208056640625,,
13.362717874999936,1400,,,,-0.052978515625,0.0201171875,-0.9986328125,0.4695010328422213,47.59317967703551,7.794711983203888,0.8225425091758375,8319,0,6.411480832143001,4.011218375729093,62.57378421737155,11.871501280690266,7.424224596431876,0.4099609375,,
15.526887749999947,1450,,,,-0.05625,0.022509765625,-0.990673828125,0.5657525008882981,58.5489883593498,7.775214719772339,1.1117649686709052,9098,0,8.64421341115231,5.286066880550996,61.15620180079118,11.080372716278493,6.773575570649973,0.466552734375,,
17.674940499999952,1500,,,,-0.05537109375,0.02265625,-0.989453125,0.6596179969831162,69.43965618531043,7.75246102809906,1.4351919246092444,9828,0,11.126254749216045,6.6574644950320065,59.8429287521779,10.43383273047069,6.241828444949839,0.27607421875,,
19.818383999999952,1550,,,,-0.060986328125,0.02490234375,-0.993798828125,0.7615294472944929,81.31980064131461,7.724266993999481,1.8169219744578011,10501,0,14.034388542352719,8.212304056833052,58.52179524258755,9.905189585801537,5.794660503278087,0.18701171875,,
21.971524749999944,1600,,,,-0.05244140625,0.02041015625,-0.998291015625,0.8677925975433333,93.07153263932358,7.690775454044342,2.2415549499169,11146,0,17.239279301895145,9.933090124895022,57.62746292951582,9.371227153746778,5.399532481772313,0.12822265625,,
24.128540874999945,1650,,,,-0.06201171875,0.020068359375,-0.995556640625,0.970229207825738,107.25366427330856,7.657302343845368,2.7162481469288475,11778,0,20.799124240476765,11.735397953644169,56.424967817978406,9.140434287901593,5.1568928252941015,0.106103515625,,
26.288647874999942,1700,,,,-0.055712890625,0.026220703125,-0.99638671875,1.0574484454145614,121.10369877440978,7.623057460784912,3.1697338861599573,12365,0,24.162997415715537,13.427998001231213,55.57814280109128,9.019269317949306,5.0124999721827255,0.10458984375,,
28.437565124999935,1750,,,,-0.056689453125,0.027392578125,-0.995458984375,1.1448296364717958,132.78702139068284,7.582610487937927,3.6702026170864706,12908,0,27.82964124423101,15.175314134475181,54.53587043696622,8.750996803612091,4.7720239351364455,0.118310546875,,
30.589732624999947,1800,,,,-0.05537109375,0.023291015625,-0.99638671875,1.2563882204261008,143.12436845894368,7.543104779720307,4.204417060054839,13332,0,31.71433436180198,17.200881501544398,54.2389468874581,8.323284895768694,4.513261358221306,0.139208984375,,
38.50847599999996,1850,,,,-0.04794921875,0.045654296875,-1.000634765625,1.322274633660558,152.99639928135167,7.506987690925598,4.83090413633734,13869,0,36.265558635188626,18.83301436106293,51.931224306466206,8.12555911299704,4.218789601841405,0.2529296875,,
46.58758637499998,1900,,,,-0.057666015625,0.0166015625,-0.996533203125,1.4344879557379469,164.65331733963401,7.46527361869812,5.4160195571556695,14288,0,40.43207471791072,21.04951006982185,52.062247032603636,7.824690117003097,4.072431621065092,0.281494140625,,
54.814946874999976,1950,,,,-0.0591796875,0.028125,-1.00087890625,1.5247061863761504,175.37146363712108,7.419740521907807,6.053605364002288,14693,0,44.91614715259921,23.007298692150716,51.22380397886805,7.623281310449451,3.904605952792408,0.377392578125,,
63.11931612499994,2000,,,,-0.054248046875,0.02919921875,-0.99814453125,1.6285657951825432,186.710592372159,7.375655913352967,6.732422516979277,15050,0,49.65605999326741,25.17027276690524,50.687849181485234,7.418806944617433,3.7601352646498842,0.445361328125,,
