﻿Time (s),ESC signal (µs),Servo 1 (µs),Servo 2 (µs),Servo 3 (µs),Thrust (gf),Voltage (V),Current (A),Motor Electrical Speed (RPM),Motor Optical Speed (RPM),Electrical Power (W),Overall Efficiency (gf/W),App message,
1.2198199000000018,1000,,,,0.11859881278027223,11.092183510406844,0.07225945577257711,0,0,0.8015151664172234,0,,
1.160670250000005,1100,,,,8.782961824936555,11.089416989556819,0.17238906772510365,0,0,1.9116944537192293,0,,
4.733323900000005,1147.36842105263,,,,21.458458000939928,11.087058336854973,0.266969431654554,2307,0,2.9599042532790922,7.251343171678002,,
8.390131050000004,1194.736842105264,,,,38.018952651299486,11.083605542537354,0.41915890078289414,3027,0,4.645791166172696,8.18534981738001,,
12.009525200000002,1242.1052631578934,,,,57.466306923978024,11.077167595968058,0.6422155292358476,3727,0,7.1139286656215095,8.078286582097753,,
15.6643676,1289.473684210523,,,,82.92249011969923,11.06835852865306,0.9551296858178452,4441,0,10.571716674591208,7.844123540568097,,
19.327888750000003,1336.8421052631593,,,,115.15136205258675,11.05649228804041,1.384988366673967,5180,0,15.313111153784144,7.5199301259688625,,
23.01217560000001,1384.2105263157873,,,,151.10029435241697,11.043702640096317,1.8863489938547244,5860,0,20.832274476609463,7.253488502656185,,
26.700519299999996,1431.578947368424,,,,195.01613189373708,11.026907621781195,2.5092974227119558,6522,0,27.66979051182268,7.047966853859064,,
30.334539600000003,1478.9473684210516,,,,248.0242656558436,11.005846014314816,3.239800742316867,7197,0,35.656746477440336,6.9559222186515655,,
33.95639540000001,1526.315789473682,,,,295.14424822833655,10.983327095520218,4.070442440896295,7813,0,44.70699777768823,6.601799746550621,,
37.584819150000015,1573.684210526318,,,,343.7850404372911,10.957266624489137,5.056144841566419,8434,0,55.40151922617172,6.205389636968153,,
41.19593830000001,1621.0526315789496,,,,394.51549915025834,10.925079176157139,6.2009853844081295,9026,0,67.74625403734244,5.8234463553145845,,
44.82777939999999,1668.4210526315758,,,,449.0478104081362,10.89117484573721,7.450568917435186,9593,0,81.14544449127608,5.533881109851182,,
48.5017708,1715.7894736842127,,,,503.0534304480274,10.853287325946294,8.829073976272428,10146,0,95.82447705373795,5.249740332903244,,
57.479660650000014,1763.1578947368441,,,,556.9679816885327,10.814359529503488,10.336098719730629,10680,0,111.77828381536547,4.9827961405561,,
66.84466220000003,1810.526315789474,,,,618.2495046406534,10.766648703134884,12.096770135494348,11187,0,130.24166409152153,4.7469454726068205,,
76.59881930000003,1857.8947368421066,,,,662.0484574145437,10.7251196844344,13.71644580674261,11727,0,147.11051755239203,4.500350792371102,,
86.7143428,1905.2631578947394,,,,726.2788729725736,10.669109689957912,15.762554754628693,12157,0,168.1724198771487,4.318654989789514,,
97.15943700000001,1952.6315789473667,,,,784.9310340000433,10.612319736027064,17.830290959431093,12616,0,189.22071940514394,4.148235133722557,,
108.0379724,2000,,,,852.4544454715594,10.545922113602566,20.405309577669282,13123,0,215.1927819578463,3.9613482759684406,,
