<?xml version="1.0" encoding="utf-8"?>
<!-- Generator: Adobe Illustrator 24.0.1, SVG Export Plug-In . SVG Version: 6.00 Build 0)  -->
<svg version="1.1" id="Layer_1" xmlns="http://www.w3.org/2000/svg" xmlns:xlink="http://www.w3.org/1999/xlink" x="0px" y="0px"
	 viewBox="0 0 116.715 116.715" style="enable-background:new 0 0 116.715 116.715;" xml:space="preserve">
<g>
	
		<rect x="1" y="58.3575" style="fill:none;stroke:#30ECCB;stroke-width:2;stroke-miterlimit:10;" width="57.3575" height="57.3575"/>
	<polyline style="fill:none;stroke:#30ECCB;stroke-width:2;stroke-miterlimit:10;" points="29.6788,58.3575 29.6788,29.6788 
		87.0363,29.6788 87.0363,87.0363 58.3575,87.0363 	"/>
	<polyline style="fill:none;stroke:#30ECCB;stroke-width:2;stroke-miterlimit:10;" points="58.3575,29.6788 58.3575,1 115.715,1 
		115.715,58.3575 87.0363,58.3575 	"/>
</g>
</svg>
