<?xml version="1.0" encoding="utf-8"?>
<!-- Generator: Adobe Illustrator 24.0.1, SVG Export Plug-In . SVG Version: 6.00 Build 0)  -->
<svg version="1.1" id="Layer_1" xmlns="http://www.w3.org/2000/svg" xmlns:xlink="http://www.w3.org/1999/xlink" x="0px" y="0px"
	 viewBox="0 0 111.8721 111.8721" style="enable-background:new 0 0 111.8721 111.8721;" xml:space="preserve">
<g>
	<path style="fill:none;stroke:#30ECCB;stroke-width:2;stroke-miterlimit:10;" d="M40.8395,71.0326l9.3367,9.3367
		c32.5371-17.8247,56.5863-46.9666,60.5473-79.2208c-32.2542,3.961-61.3961,28.0102-79.2208,60.5473L40.8395,71.0326"/>
	
		<line style="fill:none;stroke:#30ECCB;stroke-width:2;stroke-miterlimit:10;" x1="52.0153" y1="59.8568" x2="29.6637" y2="82.2084"/>
	
		<line style="fill:none;stroke:#30ECCB;stroke-width:2;stroke-miterlimit:10;" x1="24.8514" y1="87.0207" x2="2.4998" y2="109.3723"/>
	
		<line style="fill:none;stroke:#30ECCB;stroke-width:2;stroke-miterlimit:10;" x1="23.0587" y1="69.6668" x2="0.7071" y2="92.0184"/>
	
		<line style="fill:none;stroke:#30ECCB;stroke-width:2;stroke-miterlimit:10;" x1="42.2054" y1="88.8135" x2="19.8538" y2="111.165"/>
	<polyline style="fill:none;stroke:#30ECCB;stroke-width:2;stroke-miterlimit:10;" points="55.634,29.5444 29.7759,31.7344 
		7.4511,54.0592 37.6422,51.5023 	"/>
	<polyline style="fill:none;stroke:#30ECCB;stroke-width:2;stroke-miterlimit:10;" points="82.3998,56.3102 80.2098,82.1683 
		57.885,104.4931 60.442,74.3021 	"/>
	<circle style="fill:none;stroke:#30ECCB;stroke-width:2;stroke-miterlimit:10;" cx="79.106" cy="32.7661" r="6.352"/>
</g>
</svg>
