<?xml version="1.0" encoding="utf-8"?>
<!-- Generator: Adobe Illustrator 24.0.1, SVG Export Plug-In . SVG Version: 6.00 Build 0)  -->
<svg version="1.1" id="Layer_1" xmlns="http://www.w3.org/2000/svg" xmlns:xlink="http://www.w3.org/1999/xlink" x="0px" y="0px"
	 viewBox="0 0 408.3254 508.3864" style="enable-background:new 0 0 408.3254 508.3864;" xml:space="preserve">
<g>
	<g>
		<g>
			<path style="fill:#1E3042;" d="M45.4299,476.9509l-20.8273-60.2057c-0.2092-0.6046-0.7786-1.0102-1.4183-1.0102H1.5326
				c-1.0722,0-1.8124,1.0736-1.4311,2.0757l33.7202,88.6271c0.2215,0.5822,0.7797,0.9671,1.4027,0.9671h20.4158
				c0.623,0,1.1812-0.3849,1.4027-0.9671l33.7359-88.6683c0.3737-0.9822-0.3518-2.0345-1.4027-2.0345H67.6804
				c-0.6397,0-1.2091,0.4055-1.4183,1.0101L45.4299,476.9509z"/>
			<path style="fill:#1E3042;" d="M141.553,414.7487c-12.4365,0-23.3008,4.624-32.29,13.75
				c-8.9893,9.1211-13.5449,20.249-13.5449,33.0713s4.5557,23.9502,13.5449,33.0713c8.9941,9.1211,19.8584,13.7451,32.29,13.7451
				c12.4268,0,23.291-4.624,32.29-13.7451c8.9893-9.126,13.5449-20.2539,13.5449-33.0713s-4.5557-23.9453-13.5449-33.0713
				C164.8489,419.3728,153.9846,414.7487,141.553,414.7487z M157.217,478.8308c-4.1797,4.4336-9.4531,6.6846-15.6641,6.6846
				c-6.2158,0-11.4893-2.251-15.6641-6.6846c-4.1943-4.4434-6.3184-10.249-6.3184-17.2607s2.124-12.8174,6.3184-17.2607
				c4.1797-4.4336,9.4482-6.6846,15.6641-6.6846c6.2109,0,11.4795,2.251,15.6641,6.6846c4.1943,4.4434,6.3184,10.249,6.3184,17.2607
				S161.4114,474.3874,157.217,478.8308z"/>
			<path style="fill:#1E3042;" d="M277.3712,415.7351h-22.4599c-0.5216,0-1.0061,0.2695-1.2812,0.7127l-16.9014,27.2268
				l-16.9014-27.2268c-0.2751-0.4431-0.7596-0.7127-1.2812-0.7127h-22.4599c-1.1938,0-1.9143,1.3214-1.2676,2.3249l27.4032,42.5238
				l-29.3414,44.483c-0.6613,1.0026,0.0577,2.3383,1.2588,2.3383h22.4513c0.5123,0,0.9895-0.26,1.2672-0.6905l18.8709-29.2509
				l18.871,29.2509c0.2777,0.4304,0.7549,0.6905,1.2672,0.6905h22.4514c1.2011,0,1.9201-1.3357,1.2588-2.3383l-29.3414-44.483
				l27.4032-42.5238C279.2855,417.0564,278.565,415.7351,277.3712,415.7351z"/>
			<path style="fill:#1E3042;" d="M306.7092,378.3864c-3.5693,0-6.7285,1.3525-9.3896,4.0137
				c-2.6611,2.666-4.0137,5.8252-4.0137,9.3848c0,3.5645,1.3525,6.7236,4.0137,9.3896c2.666,2.6611,5.8252,4.0137,9.3896,4.0137
				c3.5596,0,6.7188-1.3525,9.3799-4.0137c2.666-2.6611,4.0186-5.8203,4.0186-9.3896c0-3.5645-1.3525-6.7236-4.0137-9.3799
				C313.4329,379.739,310.2737,378.3864,306.7092,378.3864z"/>
			<path style="fill:#1E3042;" d="M295.7957,507.405h20.8408c0.833,0,1.5083-0.6753,1.5083-1.5083v-88.6533
				c0-0.833-0.6753-1.5083-1.5083-1.5083h-20.8408c-0.833,0-1.5083,0.6753-1.5083,1.5083v88.6533
				C294.2874,506.7297,294.9626,507.405,295.7957,507.405z"/>
			<path style="fill:#1E3042;" d="M403.4768,464.822c-3.2031-4.0723-7.1973-7.0166-11.875-8.7549
				c-4.6387-1.7188-9.2529-3.1787-13.7207-4.3408c-4.4727-1.167-8.3057-2.4805-11.3965-3.8916
				c-2.9248-1.3428-4.3506-2.959-4.3506-4.9414c0-2.3193,0.8936-4.2236,2.7344-5.8154c1.8408-1.5967,4.3457-2.4023,7.4512-2.4023
				c2.9883,0,5.6689,0.8838,7.9785,2.6221c1.9129,1.4561,3.2125,3.0416,3.8733,4.731c0.2322,0.5937,0.7444,1.007,1.3818,1.0007
				l20.0271-0.1968c0.9209-0.0091,1.6529-0.8661,1.4935-1.7732c-1.3328-7.5834-4.9186-13.8319-10.6673-18.6006
				c-6.1865-5.1172-14.6191-7.71-25.0684-7.71c-9.6777,0-17.6904,2.7637-23.8086,8.2178
				c-6.1377,5.4736-9.2529,12.1777-9.2529,19.9268c0,5.8887,1.6357,10.8838,4.8584,14.8438
				c3.2129,3.9453,7.2021,6.8164,11.8652,8.5449c4.5996,1.709,9.2188,3.1396,13.7305,4.248
				c4.4531,1.0986,8.2812,2.373,11.3916,3.7939c2.8857,1.3232,4.3506,2.9834,4.3506,4.9365c0,2.4463-1.084,4.5361-3.3154,6.4014
				c-2.2314,1.8604-5.2051,2.8027-8.8379,2.8027s-6.6406-0.9766-8.9355-2.9004c-1.9876-1.6662-3.316-3.7537-3.9597-6.2179
				c-0.1757-0.6727-0.7424-1.1661-1.4377-1.1609l-19.9434,0.1491c-0.9092,0.0068-1.6321,0.8412-1.4937,1.7398
				c1.3079,8.4915,4.9654,15.3159,10.8921,20.3043c6.3037,5.3125,15.3369,8.0078,26.8457,8.0078
				c10.0684,0,18.3398-2.7637,24.585-8.2129c6.2744-5.4688,9.4531-12.1777,9.4531-19.9316
				C408.3254,474.1042,406.6946,468.9138,403.4768,464.822z"/>
		</g>
	</g>
	<g>
		<path style="fill:#30ECCB;" d="M63.5546,146.8683c11.3296,9.4634,25.2477,16.1034,40.0038,22.088
			c-7.1905-20.6098-12.538-41.4019-15.4152-62.8508c-6.344-47.2947,1.7466-79.4521,10.4657-98.9685
			c2.0988-4.698-3.3675-9.2097-7.4842-6.1228c-22.7306,17.0445-40.662,39.0542-51.7384,64.1818
			c-0.0396,0.0899-0.0725,0.1694-0.107,0.2614C35.2255,76.2724,25.2107,114.8401,63.5546,146.8683z"/>
		<path style="fill:#00B9AC;" d="M63.5546,146.8683C25.0597,114.714,35.3052,75.9686,39.3269,65.331
			c-8.0105,18.2207-12.4593,38.0507-12.4593,58.8247c0,72.8302,54.1036,134.2892,128.2081,153.8936
			c-20.6734-37.4998-38.9323-73.0211-51.5173-109.0929C88.8023,162.9717,74.8842,156.3317,63.5546,146.8683z"/>
		<path style="fill:#30ECCB;" d="M344.7708,146.8683c-11.3296,9.4634-25.2477,16.1034-40.0038,22.088
			c7.1905-20.6098,12.538-41.4019,15.4152-62.8508c6.3326-47.2094-1.7174-79.336-10.4185-98.8629
			c-2.1065-4.7273,3.3882-9.2684,7.5268-6.161c22.7287,17.0656,40.6509,39.0987,51.708,64.2493
			C373.0203,75.9686,383.2657,114.714,344.7708,146.8683z"/>
		<path style="fill:#00B9AC;" d="M344.7708,146.8683c38.4949-32.1543,28.2495-70.8998,24.2277-81.5373
			c8.0105,18.2207,12.4593,38.0507,12.4593,58.8247c0,72.8302-54.1037,134.2892-128.2081,153.8936
			c20.6734-37.4998,38.9323-73.0211,51.5173-109.0929C319.5232,162.9717,333.4412,156.3317,344.7708,146.8683z"/>
		<path style="fill:#197F8A;" d="M204.1627,238.6293c-19.3694-43.2874-62.7472-54.3194-100.6046-69.6734
			c12.5853,36.0717,30.8445,71.5937,51.5172,109.093c3.805,6.9018,7.6947,13.8733,11.6419,20.9253
			c3.545,6.333,7.1339,12.7265,10.763,19.2054c1.4879,2.6556,2.9817,5.3491,4.48,8.0322c2.619,4.6887,5.2348,9.3847,7.8784,14.1631
			l0.2411,0.4364c1.7557,3.1777,5.0995,5.1502,8.7299,5.1502h5.3532H209.5c3.6402,0,6.9931-1.9781,8.7538-5.1644l0.2334-0.4222
			c2.628-4.7503,5.2282-9.4183,7.8313-14.0802c1.5295-2.738,3.0535-5.4857,4.5722-8.1964
			c3.6132-6.4503,7.185-12.8156,10.7152-19.1205c3.9478-7.0526,7.8382-14.0264,11.6436-20.9289
			c20.6731-37.4994,38.9326-73.0213,51.5181-109.093C266.9099,184.3099,223.5316,195.3419,204.1627,238.6293z"/>
		<path style="fill:#39919A;" d="M209.5,345.9615c3.6404,0,6.9933-1.9781,8.7539-5.1644l0.2333-0.4222
			c2.6282-4.7504,5.2283-9.4183,7.8314-14.0802c1.5295-2.738,3.0536-5.4858,4.5721-8.1964
			c3.6133-6.4502,7.1851-12.8156,10.7153-19.1205c3.9478-7.0526,7.8381-14.0265,11.6437-20.929
			c20.6732-37.4994,38.9325-73.0212,51.5179-109.093c-37.8577,15.354-81.236,26.3861-100.6049,69.6735v45.954v61.3782
			L209.5,345.9615z"/>
	</g>
</g>
</svg>
