<?xml version="1.0" encoding="utf-8"?>
<!-- Generator: Adobe Illustrator 24.0.1, SVG Export Plug-In . SVG Version: 6.00 Build 0)  -->
<svg version="1.1" xmlns="http://www.w3.org/2000/svg" xmlns:xlink="http://www.w3.org/1999/xlink" x="0px" y="0px"
	 viewBox="0 0 1440 558.9725" style="enable-background:new 0 0 1440 558.9725;" xml:space="preserve">
<style type="text/css">
	.st0{fill:url(#SVGID_1_);}
	.st1{opacity:0.6;}
	.st2{fill:#00B9AC;}
	.st3{fill:#30ECCB;}
	.st4{fill:#197F8A;}
</style>
<g id="Layer_2">
	<linearGradient id="SVGID_1_" gradientUnits="userSpaceOnUse" x1="720" y1="0" x2="720" y2="558.9725">
		<stop  offset="0" style="stop-color:#2C3E4F"/>
		<stop  offset="1" style="stop-color:#030910"/>
	</linearGradient>
	<rect class="st0" width="1440" height="558.9725"/>
</g>
<g id="Layer_1">
	<g class="st1">
		<path class="st2" d="M1143.0015,539.8772c83.9963-21.4814,159.6161-59.8261,225.0593-110.7891
			c-38.548,27.1113-184.6744,108.9666-354.5932-13.5051c-53.0633-38.2411-96.2489-91.6157-137.9291-148.8802
			c-164.105-23.0319-334.6616-72.2649-503.7831-115.7689C520.1619,449.0646,836.695,618.213,1143.0015,539.8772z"/>
		<path class="st2" d="M1440,0H646.3071c96.7366,66.8626,160.9439,172.8658,229.2292,266.7023
			c0.0005,0.0001,0.0015,0.0002,0.002,0.0004c252.7696,31.0902,444.2792-56.0199,564.4617-164.3934V0z"/>
		<path class="st3" d="M1440,102.3095C1319.8175,210.683,1128.3079,297.793,875.5388,266.7026
			c41.6796,57.2646,84.8653,110.6392,137.9289,148.8803c169.9187,122.4716,316.0449,40.6165,354.5931,13.5052
			c25.6025-18.8522,49.8-40.872,71.9392-65.811V102.3095z"/>
		<path class="st4" d="M646.3071,0H0v76.5614c120.9507,12.854,245.9515,42.0197,371.7551,74.3719
			c169.1233,43.5051,339.6776,92.7376,503.7827,115.7712C807.252,172.8674,743.0447,66.8629,646.3071,0z"/>
	</g>
</g>
</svg>
