<?xml version="1.0" encoding="utf-8"?>
<!-- Generator: Adobe Illustrator 24.0.1, SVG Export Plug-In . SVG Version: 6.00 Build 0)  -->
<svg version="1.1" id="Layer_1" xmlns="http://www.w3.org/2000/svg" xmlns:xlink="http://www.w3.org/1999/xlink" x="0px" y="0px"
	 viewBox="0 0 153.447 112.5348" style="enable-background:new 0 0 153.447 112.5348;" xml:space="preserve">
<g>
	<path style="fill:none;stroke:#30ECCB;stroke-width:2;stroke-miterlimit:10;" d="M149.8483,111.5348H3.5987
		C2.1635,111.5348,1,110.3713,1,108.936V3.5987C1,2.1635,2.1635,1,3.5987,1h146.2495c1.4352,0,2.5987,1.1635,2.5987,2.5987V108.936
		C152.447,110.3713,151.2835,111.5348,149.8483,111.5348z"/>
	<circle style="fill:none;stroke:#30ECCB;stroke-width:2;stroke-miterlimit:10;" cx="13.3257" cy="12.843" r="3.8238"/>
	<circle style="fill:none;stroke:#30ECCB;stroke-width:2;stroke-miterlimit:10;" cx="27.9191" cy="12.843" r="3.8238"/>
	<circle style="fill:none;stroke:#30ECCB;stroke-width:2;stroke-miterlimit:10;" cx="42.5125" cy="12.843" r="3.8238"/>
	<line style="fill:none;stroke:#30ECCB;stroke-width:2;stroke-miterlimit:10;" x1="1" y1="24.686" x2="152.447" y2="24.686"/>
	
		<line style="fill:none;stroke:#30ECCB;stroke-width:2;stroke-miterlimit:10;" x1="22.5327" y1="52.5132" x2="130.9143" y2="52.5132"/>
	
		<line style="fill:none;stroke:#30ECCB;stroke-width:2;stroke-miterlimit:10;" x1="22.5327" y1="66.8684" x2="130.9143" y2="66.8684"/>
	
		<line style="fill:none;stroke:#30ECCB;stroke-width:2;stroke-miterlimit:10;" x1="22.5327" y1="81.2235" x2="130.9143" y2="81.2235"/>
</g>
</svg>
