<?xml version="1.0" encoding="utf-8"?>
<!-- Generator: Adobe Illustrator 24.0.1, SVG Export Plug-In . SVG Version: 6.00 Build 0)  -->
<svg version="1.1" id="Layer_1" xmlns="http://www.w3.org/2000/svg" xmlns:xlink="http://www.w3.org/1999/xlink" x="0px" y="0px"
	 viewBox="0 0 142.5012 142.5795" style="enable-background:new 0 0 142.5012 142.5795;" xml:space="preserve">
<g>
	<circle style="fill:none;stroke:#30ECCB;stroke-width:2;stroke-miterlimit:10;" cx="74.4938" cy="73.3373" r="21.4629"/>
	<circle style="fill:none;stroke:#30ECCB;stroke-width:2;stroke-miterlimit:10;" cx="71.3644" cy="25.8079" r="11.7388"/>
	<circle style="fill:none;stroke:#30ECCB;stroke-width:2;stroke-miterlimit:10;" cx="115.2335" cy="8.4464" r="7.4464"/>
	<circle style="fill:none;stroke:#30ECCB;stroke-width:2;stroke-miterlimit:10;" cx="120.8996" cy="86.3145" r="9.9471"/>
	<circle style="fill:none;stroke:#30ECCB;stroke-width:2;stroke-miterlimit:10;" cx="83.1032" cy="124.7131" r="9.9471"/>
	<circle style="fill:none;stroke:#30ECCB;stroke-width:2;stroke-miterlimit:10;" cx="17.8816" cy="130.2273" r="11.3522"/>
	<circle style="fill:none;stroke:#30ECCB;stroke-width:2;stroke-miterlimit:10;" cx="14.672" cy="90.1254" r="13.672"/>
	<circle style="fill:none;stroke:#30ECCB;stroke-width:2;stroke-miterlimit:10;" cx="59.6257" cy="108.4727" r="6.2934"/>
	<circle style="fill:none;stroke:#30ECCB;stroke-width:2;stroke-miterlimit:10;" cx="31.2376" cy="55.8188" r="8.9293"/>
	<circle style="fill:none;stroke:#30ECCB;stroke-width:2;stroke-miterlimit:10;" cx="28.5552" cy="19.0166" r="12.911"/>
	<circle style="fill:none;stroke:#30ECCB;stroke-width:2;stroke-miterlimit:10;" cx="127.4772" cy="49.5254" r="14.024"/>
	<circle style="fill:none;stroke:#30ECCB;stroke-width:2;stroke-miterlimit:10;" cx="127.4772" cy="126.1504" r="14.024"/>
	
		<line style="fill:none;stroke:#30ECCB;stroke-width:2;stroke-miterlimit:10;" x1="59.6257" y1="88.2784" x2="25.8882" y2="122.1814"/>
	<path style="fill:none;stroke:#30ECCB;stroke-width:2;stroke-miterlimit:10;" d="M14.672,90.1254"/>
	
		<line style="fill:none;stroke:#30ECCB;stroke-width:2;stroke-miterlimit:10;" x1="54.1648" y1="80.2267" x2="27.9232" y2="86.8041"/>
	
		<line style="fill:none;stroke:#30ECCB;stroke-width:2;stroke-miterlimit:10;" x1="54.6003" y1="65.2806" x2="39.5109" y2="59.1694"/>
	
		<line style="fill:none;stroke:#30ECCB;stroke-width:2;stroke-miterlimit:10;" x1="60.6358" y1="56.9508" x2="36.8881" y2="28.8701"/>
	
		<line style="fill:none;stroke:#30ECCB;stroke-width:2;stroke-miterlimit:10;" x1="73.0807" y1="51.8744" x2="72.1354" y2="37.5181"/>
	
		<line style="fill:none;stroke:#30ECCB;stroke-width:2;stroke-miterlimit:10;" x1="85.9058" y1="55.1601" x2="111.2768" y2="14.7487"/>
	
		<line style="fill:none;stroke:#30ECCB;stroke-width:2;stroke-miterlimit:10;" x1="94.0699" y1="64.5394" x2="114.6863" y2="55.2739"/>
	
		<line style="fill:none;stroke:#30ECCB;stroke-width:2;stroke-miterlimit:10;" x1="111.3193" y1="83.6354" x2="95.164" y2="79.1176"/>
	
		<line style="fill:none;stroke:#30ECCB;stroke-width:2;stroke-miterlimit:10;" x1="117.545" y1="116.2501" x2="89.6944" y2="88.4891"/>
	
		<line style="fill:none;stroke:#30ECCB;stroke-width:2;stroke-miterlimit:10;" x1="81.4606" y1="114.9112" x2="78.041" y2="94.5047"/>
	
		<line style="fill:none;stroke:#30ECCB;stroke-width:2;stroke-miterlimit:10;" x1="66.1274" y1="93.1083" x2="62.0789" y2="102.6755"/>
</g>
</svg>
