<?xml version="1.0" encoding="utf-8"?>
<!-- Generator: Adobe Illustrator 24.0.1, SVG Export Plug-In . SVG Version: 6.00 Build 0)  -->
<svg version="1.1" id="Layer_1" xmlns="http://www.w3.org/2000/svg" xmlns:xlink="http://www.w3.org/1999/xlink" x="0px" y="0px"
	 viewBox="0 0 93.5315 104.7686" style="enable-background:new 0 0 93.5315 104.7686;" xml:space="preserve">
<g>
	<polyline style="fill:none;stroke:#30ECCB;stroke-width:2;stroke-miterlimit:10;" points="41.1471,20.159 41.1471,52.3843 
		58.7853,70.0224 	"/>
	<path style="fill:none;stroke:#30ECCB;stroke-width:2;stroke-miterlimit:10;" d="M1,20.3102C10.4161,8.5394,24.9012,1,41.1471,1
		c28.3788,0,51.3843,23.0055,51.3843,51.3843s-23.0055,51.3843-51.3843,51.3843c-14.1894,0-27.0355-5.7514-36.3342-15.0501"/>
	<polyline style="fill:none;stroke:#30ECCB;stroke-width:2;stroke-miterlimit:10;" points="20.159,20.159 1,20.159 1,1 	"/>
</g>
</svg>
