<?xml version="1.0" encoding="utf-8"?>
<!-- Generator: Adobe Illustrator 24.0.1, SVG Export Plug-In . SVG Version: 6.00 Build 0)  -->
<svg version="1.1" xmlns="http://www.w3.org/2000/svg" xmlns:xlink="http://www.w3.org/1999/xlink" x="0px" y="0px"
	 viewBox="0 0 658.4445 191.9562" style="enable-background:new 0 0 658.4445 191.9562;" xml:space="preserve">
<g id="Layer_1">
	<g>
		<g>
			<path style="fill:#FFFFFF;" d="M295.2402,111.3802l-20.845-60.2569c-0.2094-0.6051-0.7793-1.011-1.4196-1.011h-21.6701
				c-1.0731,0-1.8139,1.0745-1.4323,2.0774l33.7489,88.7025c0.2217,0.5828,0.7804,0.9679,1.4039,0.9679h20.4332
				c0.6235,0,1.1822-0.3852,1.4039-0.9679l33.7646-88.7437c0.3741-0.9831-0.3521-2.0362-1.4039-2.0362h-21.7142
				c-0.6403,0-1.2102,0.4058-1.4195,1.0109L295.2402,111.3802z"/>
			<path style="fill:#FFFFFF;" d="M391.4451,49.1252c-12.4471,0-23.3206,4.628-32.3175,13.7617
				c-8.9969,9.1289-13.5565,20.2663-13.5565,33.0994s4.5595,23.9706,13.5565,33.0994c9.0018,9.1288,19.8753,13.7568,32.3175,13.7568
				c12.4373,0,23.3108-4.628,32.3175-13.7568c8.9969-9.1337,13.5564-20.2711,13.5564-33.0994s-4.5595-23.9657-13.5564-33.0994
				C414.7608,53.7531,403.8873,49.1252,391.4451,49.1252z M407.1224,113.2617c-4.1832,4.4374-9.4612,6.6903-15.6774,6.6903
				c-6.2211,0-11.4991-2.2529-15.6774-6.6903c-4.1979-4.4471-6.3237-10.2577-6.3237-17.2754c0-7.0177,2.1258-12.8283,6.3237-17.2754
				c4.1833-4.4374,9.4563-6.6903,15.6774-6.6903c6.2162,0,11.4893,2.2529,15.6774,6.6903
				c4.1979,4.4471,6.3237,10.2577,6.3237,17.2754C413.4462,103.004,411.3203,108.8146,407.1224,113.2617z"/>
			<path style="fill:#FFFFFF;" d="M527.3788,50.1124h-22.479c-0.522,0-1.007,0.2698-1.2823,0.7133l-16.9157,27.25l-16.9157-27.25
				c-0.2753-0.4435-0.7603-0.7133-1.2823-0.7133h-22.479c-1.1948,0-1.9159,1.3225-1.2686,2.3268l27.4265,42.56L442.8163,139.52
				c-0.6619,1.0035,0.0578,2.3403,1.2599,2.3403h22.4704c0.5127,0,0.9903-0.2603,1.2682-0.6911l18.887-29.2758l18.887,29.2758
				c0.2779,0.4308,0.7556,0.6911,1.2682,0.6911h22.4704c1.2021,0,1.9218-1.3368,1.2599-2.3403L501.221,94.9991l27.4265-42.56
				C529.2947,51.4348,528.5737,50.1124,527.3788,50.1124z"/>
			<path style="fill:#FFFFFF;" d="M556.7418,12.7319c-3.5724,0-6.7343,1.3537-9.3976,4.0171
				c-2.6634,2.6683-4.0171,5.8302-4.0171,9.3927c0,3.5675,1.3537,6.7294,4.0171,9.3976c2.6683,2.6634,5.8301,4.0171,9.3976,4.0171
				c3.5626,0,6.7244-1.3537,9.3878-4.0171c2.6683-2.6634,4.022-5.8253,4.022-9.3976c0-3.5675-1.3537-6.7294-4.0171-9.3879
				C563.4711,14.0856,560.3093,12.7319,556.7418,12.7319z"/>
			<path style="fill:#FFFFFF;" d="M545.819,141.8602h20.8585c0.8337,0,1.5096-0.6759,1.5096-1.5096V51.6219
				c0-0.8337-0.6758-1.5096-1.5096-1.5096H545.819c-0.8337,0-1.5096,0.6759-1.5096,1.5096v88.7287
				C544.3093,141.1844,544.9852,141.8602,545.819,141.8602z"/>
			<path style="fill:#FFFFFF;" d="M653.5917,99.241c-3.2058-4.0757-7.2034-7.0226-11.8851-8.7623
				c-4.6426-1.7202-9.2608-3.1814-13.7324-4.3445c-4.4764-1.168-8.3127-2.4826-11.4061-3.8949
				c-2.9273-1.3439-4.3543-2.9615-4.3543-4.9456c0-2.3213,0.8943-4.2272,2.7367-5.8204c1.8424-1.598,4.3494-2.4044,7.4575-2.4044
				c2.9908,0,5.6738,0.8845,7.9853,2.6243c1.9145,1.4573,3.2153,3.0442,3.8766,4.735c0.2324,0.5941,0.7451,1.0078,1.3831,1.0016
				l20.0441-0.197c0.9217-0.0091,1.6544-0.8669,1.4948-1.7747c-1.334-7.5899-4.9229-13.8437-10.6764-18.6164
				c-6.1918-5.1215-14.6316-7.7165-25.0897-7.7165c-9.686,0-17.7054,2.766-23.8289,8.2248
				c-6.1429,5.4783-9.2608,12.1881-9.2608,19.9437c0,5.8937,1.6371,10.8931,4.8625,14.8564
				c3.2156,3.9487,7.2083,6.8222,11.8754,8.5522c4.6035,1.7104,9.2266,3.1423,13.7421,4.2517
				c4.4569,1.0996,8.2883,2.3751,11.4013,3.7972c2.8882,1.3244,4.3542,2.9859,4.3542,4.9407c0,2.4484-1.0849,4.54-3.3182,6.4068
				c-2.2333,1.8619-5.2095,2.8051-8.8454,2.8051s-6.6463-0.9774-8.9432-2.9029c-1.9893-1.6676-3.3188-3.7569-3.963-6.2232
				c-0.1758-0.6733-0.743-1.1671-1.4389-1.1619l-19.9603,0.1492c-0.91,0.0068-1.6335,0.8419-1.495,1.7413
				c1.309,8.4987,4.9696,15.3289,10.9013,20.3216c6.3091,5.317,15.35,8.0146,26.8685,8.0146c10.077,0,18.3555-2.766,24.6059-8.2199
				c6.2797-5.4734,9.4612-12.1881,9.4612-19.9486C658.4445,108.5311,656.8122,103.3363,653.5917,99.241z"/>
		</g>
		<g>
			<path style="fill:#30ECCB;" d="M20.3557,81.4897c6.2862,5.2507,14.0086,8.9349,22.1961,12.2555
				c-3.9896-11.4353-6.9567-22.9718-8.5531-34.8727c-3.52-26.2414,0.9691-44.0838,5.8069-54.9125
				c1.1645-2.6067-1.8684-5.11-4.1526-3.3972c-12.612,9.4571-22.5613,21.6692-28.707,35.6112
				c-0.022,0.0499-0.0402,0.094-0.0594,0.145C4.6374,42.3196-0.9194,63.7189,20.3557,81.4897z"/>
			<path style="fill:#00B9AC;" d="M20.3557,81.4897C-1.0031,63.6489,4.6815,42.1511,6.913,36.2488
				C2.4684,46.3585,0,57.3612,0,68.8876c0,40.4098,30.0193,74.5102,71.136,85.3876c-11.4706-20.8067-21.6015-40.5156-28.5843-60.53
				C34.3643,90.4246,26.6419,86.7404,20.3557,81.4897z"/>
			<path style="fill:#30ECCB;" d="M176.3881,81.4897c-6.2862,5.2507-14.0086,8.9349-22.196,12.2555
				c3.9896-11.4353,6.9567-22.9718,8.5531-34.8727c3.5136-26.194-0.9529-44.0194-5.7807-54.8539
				c-1.1688-2.6229,1.8799-5.1426,4.1763-3.4184c12.611,9.4688,22.5551,21.6938,28.6901,35.6486
				C192.0622,42.1511,197.7469,63.6489,176.3881,81.4897z"/>
			<path style="fill:#00B9AC;" d="M176.3881,81.4897c21.3588-17.8408,15.6742-39.3386,13.4427-45.2409
				c4.4446,10.1097,6.913,21.1124,6.913,32.6388c0,40.4098-30.0193,74.5102-71.136,85.3876
				c11.4706-20.8067,21.6015-40.5156,28.5843-60.53C162.3795,90.4246,170.1019,86.7404,176.3881,81.4897z"/>
			<path style="fill:#197F8A;" d="M98.3719,132.4031c-10.7471-24.0179-34.8152-30.139-55.8203-38.6582
				c6.9829,20.0143,17.114,39.7236,28.5842,60.5301c2.1112,3.8295,4.2694,7.6976,6.4595,11.6104
				c1.9669,3.5139,3.9583,7.0613,5.9718,10.6561c0.8256,1.4734,1.6544,2.968,2.4857,4.4567
				c1.4531,2.6015,2.9045,5.2071,4.3713,7.8584l0.1338,0.2421c0.9741,1.7631,2.8295,2.8576,4.8438,2.8576h2.9702h2.9614
				c2.0198,0,3.8801-1.0975,4.8571-2.8655l0.1295-0.2343c1.4581-2.6357,2.9009-5.2257,4.3452-7.8124
				c0.8486-1.5192,1.6942-3.0438,2.5369-4.5477c2.0048-3.5789,3.9866-7.1107,5.9453-10.609
				c2.1904-3.9131,4.349-7.7825,6.4604-11.6124c11.4705-20.8065,21.6017-40.5157,28.5847-60.5301
				C133.1871,102.2641,109.1187,108.3852,98.3719,132.4031z"/>
			<path style="fill:#39919A;" d="M101.3333,191.9562c2.0199,0,3.8802-1.0975,4.8571-2.8654l0.1294-0.2342
				c1.4582-2.6357,2.9009-5.2258,4.3453-7.8124c0.8487-1.5192,1.6943-3.0438,2.5368-4.5478
				c2.0048-3.5789,3.9866-7.1107,5.9454-10.609c2.1904-3.9131,4.349-7.7826,6.4605-11.6124
				c11.4705-20.8065,21.6016-40.5157,28.5846-60.5301c-21.0053,8.5191-45.0736,14.6403-55.8204,38.6582v25.4975v34.0556H101.3333z"
				/>
		</g>
	</g>
</g>
<g id="Layer_2">
</g>
</svg>
