<?xml version="1.0" encoding="UTF-8"?>
<!-- Generator: Adobe Illustrator 26.0.3, SVG Export Plug-In . SVG Version: 6.00 Build 0)  -->
<svg version="1.1" xmlns="http://www.w3.org/2000/svg" xmlns:xlink="http://www.w3.org/1999/xlink" x="0px" y="0px" viewBox="0 0 422.6 75.3" style="enable-background:new 0 0 422.6 75.3;" xml:space="preserve">
<style type="text/css">
	.st0{display:none;}
	.st1{display:inline;}
</style>
<g id="Layer_1" class="st0">
	<g class="st1">
		<path d="M83.6,57.4h-8.9l-1.9,7.2H14.7l2.1-7.2H3.1c-1.7,0-3.1,1.4-3.1,3.1v11.2c0,1.7,1.4,3.1,3.1,3.1c0,0,0,0,0,0h80.5    c1.7,0,3.1-1.4,3.1-3.1c0,0,0,0,0,0V60.5C86.8,58.8,85.4,57.4,83.6,57.4C83.6,57.4,83.6,57.4,83.6,57.4z"/>
		<path d="M76.1,64.6h-7.2L81,22L34.1,8.7L18.2,64.6H11L28.4,3.5c0.5-1.8,2.4-2.9,4.3-2.4c0,0,0,0,0,0l53.6,15.2    c1.8,0.5,2.9,2.4,2.4,4.3c0,0,0,0,0,0L76.1,64.6z"/>
		<path d="M37.4,23.3L37.4,23.3c0.5-1.8,2.4-2.9,4.3-2.4l26.8,7.6c1.8,0.5,2.9,2.4,2.4,4.3l0,0c-0.5,1.8-2.4,2.9-4.3,2.4l-26.8-7.6    C37.9,27.1,36.9,25.1,37.4,23.3z"/>
		<path d="M33.5,36.8L33.5,36.8c0.5-1.8,2.4-2.9,4.3-2.4l17.9,5.1c1.8,0.5,2.9,2.4,2.4,4.3l0,0c-0.5,1.8-2.4,2.9-4.3,2.4L35.8,41    C34,40.5,32.9,38.6,33.5,36.8z"/>
		<path d="M29.7,49.7L29.7,49.7c0.5-1.8,2.4-2.9,4.3-2.4l9.1,2.6c1.8,0.5,2.9,2.4,2.4,4.3l0,0c-0.5,1.8-2.4,2.9-4.3,2.4L32.1,54    C30.3,53.5,29.2,51.6,29.7,49.7z"/>
	</g>
</g>
<g id="Layer_2">
	<g>
		<path d="M122.1,74.4l-17-52.1h10.1l8,25.4l4.6,17.3h0.2l4.5-17.3l8-25.4h9.8l-17,52.1H122.1z"/>
		<path d="M152.8,48.4c0-17.6,9-26.9,22.7-26.9c13.7,0,22.7,9.3,22.7,26.9c0,17.6-8.9,26.9-22.7,26.9    C161.9,75.3,152.8,66,152.8,48.4z M187.8,52.4v-8.1c0-8.9-4.8-14.2-12.2-14.2c-7.5,0-12.2,5.3-12.2,14.2v8.1    c0,8.9,4.8,14.2,12.2,14.2C183,66.6,187.8,61.3,187.8,52.4z"/>
		<path d="M227,31.1v43.3h-9.8V31.1h-14.8v-8.7h39.4v8.7H227z"/>
		<path d="M248.9,74.4V22.3h34.3v8.7h-24.5v12.6h21.6v8.7h-21.6v13.3h24.5v8.7H248.9z"/>
		<path d="M289.6,74.4L300,22.3h9.4L300.7,66h19.8l-1.6,8.4H289.6z"/>
		<path d="M326.1,54.4c0-17.8,10.9-33,26.8-33c10.1,0,18.6,6.6,18.6,20.9c0,17.8-10.8,33-26.7,33C334.7,75.3,326.1,68.7,326.1,54.4z     M359.9,52.5l1.6-7.8c0.4-1.6,0.4-3.1,0.4-4.3c0-6.7-3.4-10.5-9.8-10.5c-7.5,0-12.7,5.3-14.5,14.4l-1.6,7.8    c-0.4,1.6-0.4,3.1-0.4,4.3c0,6.7,3.4,10.5,9.8,10.5C353,66.9,358.1,61.6,359.9,52.5z"/>
		<path d="M408.9,66.3h-0.5c-2.5,4.9-7.2,8.9-14.5,8.9c-9.9,0-16.9-7.1-16.9-20.8c0-18.4,10.6-33,27.1-33c9.1,0,16.2,4.4,18.4,12.2    l-8,4.1c-1.4-5-5.4-7.8-11.1-7.8c-8.2,0-13.1,5.4-14.8,13.9l-1.6,8c-0.3,1.4-0.4,3-0.4,4.3c0,7.2,4.1,10.7,9.7,10.7    c6.6,0,12.2-3.9,13.3-9.7l0.6-3h-9.9l1.6-8h18.9l-5.7,28.2h-7.9L408.9,66.3z"/>
	</g>
</g>
<g id="Layer_3">
	<g id="Layer_2_00000176045601783769120900000007866897536748870534_">
		<g id="Layer_1-2">
			<polygon points="71.8,29.4 38.4,19.9 36.3,26.5 69.7,36    "/>
			<polygon points="59,40.3 34.4,33.3 32.4,39.9 56.9,46.9    "/>
			<polygon points="46.2,50.7 30.8,46.3 28.6,52.9 44.6,57.4    "/>
			<path d="M80.7,48.2l8.8-31.1L29.3,0l-6.6,23.3L13,57.2H-0.1v17.4h86.8V57.2h-8.6L80.7,48.2L80.7,48.2z M18.2,64.5L34.1,8.5     l46.9,13.3L68.9,64.5H18.2z"/>
		</g>
	</g>
</g>
</svg>