[
  {
    "line": 1,
    "date": "8.9.",
    "name": "Ela",
    "style": "sun",
    "video": "IMG_5320.MOV",
    "V0": "8,8925",
    "Y0": "1,82",
    "A0": "24,66",
    "TV": "0,38",
    "YV": "2,53",
    "TD": "1,10",
    "XD": "8,86",
    "IA0": "39,69",
    "ITV": "0,58",
    "IYV": "3,47",
    "ITD": "1,42",
    "IXD": "9,72",
    "delta": "0,86"
  },
  {
    "line": 2,
    "date": "8.9.",
    "name": "Ela",
    "style": "sun",
    "video": "IMG_5321.MOV",
    "V0": "7,8652",
    "Y0": "1,76",
    "A0": "29,96",
    "TV": "0,40",
    "YV": "2,54",
    "TD": "1,12",
    "XD": "7,64",
    "IA0": "38,71",
    "ITV": "0,50",
    "IYV": "2,99",
    "ITD": "1,28",
    "IXD": "7,87",
    "delta": "0,23"
  },
  {
    "line": 3,
    "date": "8.9.",
    "name": "Ela",
    "style": "sun",
    "video": "IMG_5322.MOV",
    "V0": "8,5780",
    "Y0": "2,03",
    "A0": "28,02",
    "TV": "0,41",
    "YV": "2,86",
    "TD": "1,17",
    "XD": "8,90",
    "IA0": "38,85",
    "ITV": "0,55",
    "IYV": "3,51",
    "ITD": "1,39",
    "IXD": "9,32",
    "delta": "0,42"
  },
  {
    "line": 4,
    "date": "8.9.",
    "name": "Ela",
    "style": "sun",
    "video": "IMG_5323.MOV",
    "V0": "8,4904",
    "Y0": "1,44",
    "A0": "33,38",
    "TV": "0,48",
    "YV": "2,55",
    "TD": "1,20",
    "XD": "8,49",
    "IA0": "40,28",
    "ITV": "0,56",
    "IYV": "2,98",
    "ITD": "1,34",
    "IXD": "8,67",
    "delta": "0,18"
  },
  {
    "line": 5,
    "date": "8.9.",
    "name": "Ela",
    "style": "sun",
    "video": "IMG_5326.MOV",
    "V0": "7,6252",
    "Y0": "1,71",
    "A0": "27,12",
    "TV": "0,35",
    "YV": "2,33",
    "TD": "1,04",
    "XD": "7,08",
    "IA0": "38,52",
    "ITV": "0,48",
    "IYV": "2,86",
    "ITD": "1,25",
    "IXD": "7,45",
    "delta": "0,36"
  },
  {
    "line": 6,
    "date": "8.9.",
    "name": "Ela",
    "style": "sun",
    "video": "IMG_5328.MOV",
    "V0": "7,8068",
    "Y0": "1,82",
    "A0": "24,17",
    "TV": "0,33",
    "YV": "2,34",
    "TD": "1,02",
    "XD": "7,24",
    "IA0": "38,46",
    "ITV": "0,50",
    "IYV": "3,02",
    "ITD": "1,28",
    "IXD": "7,82",
    "delta": "0,58"
  },
  {
    "line": 7,
    "date": "8.9.",
    "name": "Ela",
    "style": "sun, přešlap",
    "video": "IMG_5329.MOV",
    "V0": "7,9798",
    "Y0": "1,90",
    "A0": "30,83",
    "TV": "0,42",
    "YV": "2,75",
    "TD": "1,17",
    "XD": "7,99",
    "IA0": "38,45",
    "ITV": "0,51",
    "IYV": "3,16",
    "ITD": "1,31",
    "IXD": "8,18",
    "delta": "0,18"
  },
  {
    "line": 8,
    "date": "8.9.",
    "name": "Ela",
    "style": "sun",
    "video": "IMG_5330.MOV",
    "V0": "9,0007",
    "Y0": "1,79",
    "A0": "31,62",
    "TV": "0,48",
    "YV": "2,92",
    "TD": "1,25",
    "XD": "9,61",
    "IA0": "39,87",
    "ITV": "0,59",
    "IYV": "3,49",
    "ITD": "1,43",
    "IXD": "9,89",
    "delta": "0,28"
  },
  {
    "line": 9,
    "date": "8.9.",
    "name": "Ela",
    "style": "sun",
    "video": "IMG_5331.MOV",
    "V0": "8,4019",
    "Y0": "1,78",
    "A0": "25,48",
    "TV": "0,37",
    "YV": "2,45",
    "TD": "1,08",
    "XD": "8,16",
    "IA0": "39,27",
    "ITV": "0,54",
    "IYV": "3,23",
    "ITD": "1,35",
    "IXD": "8,80",
    "delta": "0,65"
  },
  {
    "line": 10,
    "date": "8.9.",
    "name": "Ela",
    "style": "sun, přešlap",
    "video": "IMG_5332.MOV",
    "V0": "8,9442",
    "Y0": "1,80",
    "A0": "30,55",
    "TV": "0,46",
    "YV": "2,86",
    "TD": "1,23",
    "XD": "9,45",
    "IA0": "39,79",
    "ITV": "0,58",
    "IYV": "3,47",
    "ITD": "1,43",
    "IXD": "9,80",
    "delta": "0,35"
  },
  {
    "line": 11,
    "date": "8.9.",
    "name": "Ela",
    "style": "sun",
    "video": "IMG_5333.MOV",
    "V0": "8,5101",
    "Y0": "1,53",
    "A0": "33,61",
    "TV": "0,48",
    "YV": "2,66",
    "TD": "1,22",
    "XD": "8,63",
    "IA0": "40,06",
    "ITV": "0,56",
    "IYV": "3,06",
    "ITD": "1,35",
    "IXD": "8,78",
    "delta": "0,16"
  },
  {
    "line": 12,
    "date": "8.9.",
    "name": "Ela",
    "style": "sun, přešlap",
    "video": "IMG_5334.MOV",
    "V0": "8,8715",
    "Y0": "1,72",
    "A0": "24,48",
    "TV": "0,37",
    "YV": "2,41",
    "TD": "1,08",
    "XD": "8,69",
    "IA0": "39,92",
    "ITV": "0,58",
    "IYV": "3,37",
    "ITD": "1,41",
    "IXD": "9,59",
    "delta": "0,91"
  },
  {
    "line": 13,
    "date": "9.10.",
    "name": "Eliáš",
    "style": "z místa",
    "video": "IMG_5695.MOV",
    "V0": "7,3469",
    "Y0": "1,63",
    "A0": "35,94",
    "TV": "0,44",
    "YV": "2,58",
    "TD": "1,17",
    "XD": "6,93",
    "IA0": "38,38",
    "ITV": "0,47",
    "IYV": "2,69",
    "ITD": "1,21",
    "IXD": "6,95",
    "delta": "0,02"
  },
  {
    "line": 14,
    "date": "9.10.",
    "name": "Vojta",
    "style": "z místa",
    "video": "IMG_5696.MOV",
    "V0": "8,9085",
    "Y0": "1,56",
    "A0": "41,80",
    "TV": "0,61",
    "YV": "3,36",
    "TD": "1,43",
    "XD": "9,52",
    "IA0": "40,35",
    "ITV": "0,59",
    "IYV": "3,26",
    "ITD": "1,40",
    "IXD": "9,53",
    "delta": "0,01"
  },
  {
    "line": 15,
    "date": "9.10.",
    "name": "Ela",
    "style": "z místa, přešlap",
    "video": "IMG_5697.MOV",
    "V0": "9,1005",
    "Y0": "2,14",
    "A0": "27,18",
    "TV": "0,42",
    "YV": "3,02",
    "TD": "1,21",
    "XD": "9,79",
    "IA0": "39,17",
    "ITV": "0,59",
    "IYV": "3,83",
    "ITD": "1,47",
    "IXD": "10,37",
    "delta": "0,58"
  },
  {
    "line": 16,
    "date": "9.10.",
    "name": "Valda",
    "style": "z místa",
    "video": "IMG_5698.MOV",
    "V0": "6,3421",
    "Y0": "1,48",
    "A0": "37,65",
    "TV": "0,40",
    "YV": "2,25",
    "TD": "1,07",
    "XD": "5,38",
    "IA0": "37,30",
    "ITV": "0,39",
    "IYV": "2,24",
    "ITD": "1,07",
    "IXD": "5,38",
    "delta": "0,00"
  },
  {
    "line": 17,
    "date": "9.10.",
    "name": "Eliáš",
    "style": "z místa",
    "video": "IMG_5700.MOV",
    "V0": "7,3227",
    "Y0": "1,99",
    "A0": "31,27",
    "TV": "0,39",
    "YV": "2,73",
    "TD": "1,13",
    "XD": "7,09",
    "IA0": "37,27",
    "ITV": "0,45",
    "IYV": "2,99",
    "ITD": "1,23",
    "IXD": "7,19",
    "delta": "0,09"
  },
  {
    "line": 18,
    "date": "9.10.",
    "name": "Vojta",
    "style": "z místa",
    "video": "IMG_5701.MOV",
    "V0": "9,3447",
    "Y0": "1,96",
    "A0": "35,95",
    "TV": "0,56",
    "YV": "3,50",
    "TD": "1,40",
    "XD": "10,62",
    "IA0": "39,80",
    "ITV": "0,61",
    "IYV": "3,79",
    "ITD": "1,49",
    "IXD": "10,69",
    "delta": "0,07"
  },
  {
    "line": 19,
    "date": "9.10.",
    "name": "Valda",
    "style": "z místa",
    "video": "IMG_5702.MOV",
    "V0": "7,8689",
    "Y0": "1,90",
    "A0": "33,79",
    "TV": "0,45",
    "YV": "2,88",
    "TD": "1,21",
    "XD": "7,93",
    "IA0": "38,31",
    "ITV": "0,50",
    "IYV": "3,12",
    "ITD": "1,29",
    "IXD": "7,99",
    "delta": "0,06"
  },
  {
    "line": 20,
    "date": "9.10.",
    "name": "Ela",
    "style": "z místa, přešlap",
    "video": "IMG_5703.MOV",
    "V0": "6,5538",
    "Y0": "1,97",
    "A0": "41,22",
    "TV": "0,44",
    "YV": "2,92",
    "TD": "1,21",
    "XD": "5,98",
    "IA0": "35,97",
    "ITV": "0,39",
    "IYV": "2,72",
    "ITD": "1,14",
    "IXD": "6,04",
    "delta": "0,06"
  },
  {
    "line": 21,
    "date": "9.10.",
    "name": "Valda",
    "style": "z místa",
    "video": "IMG_5704.MOV",
    "V0": "7,8351",
    "Y0": "1,71",
    "A0": "36,79",
    "TV": "0,48",
    "YV": "2,84",
    "TD": "1,24",
    "XD": "7,77",
    "IA0": "38,79",
    "ITV": "0,50",
    "IYV": "2,94",
    "ITD": "1,28",
    "IXD": "7,79",
    "delta": "0,01"
  },
  {
    "line": 22,
    "date": "12.10.",
    "name": "Valda",
    "style": "poskok",
    "video": "IMG_5732.MOV",
    "V0": "7,3912",
    "Y0": "1,69",
    "A0": "27,97",
    "TV": "0,35",
    "YV": "2,30",
    "TD": "1,04",
    "XD": "6,78",
    "IA0": "38,28",
    "ITV": "0,47",
    "IYV": "2,76",
    "ITD": "1,22",
    "IXD": "7,06",
    "delta": "0,28"
  },
  {
    "line": 23,
    "date": "12.10.",
    "name": "Vojta",
    "style": "poskok",
    "video": "IMG_5735.MOV",
    "V0": "8,2541",
    "Y0": "1,94",
    "A0": "38,58",
    "TV": "0,52",
    "YV": "3,29",
    "TD": "1,34",
    "XD": "8,67",
    "IA0": "38,69",
    "ITV": "0,53",
    "IYV": "3,30",
    "ITD": "1,35",
    "IXD": "8,67",
    "delta": "0,00"
  },
  {
    "line": 24,
    "date": "12.10.",
    "name": "Ela",
    "style": "poskok",
    "video": "IMG_5736.MOV",
    "V0": "8,6216",
    "Y0": "1,81",
    "A0": "38,18",
    "TV": "0,54",
    "YV": "3,26",
    "TD": "1,36",
    "XD": "9,21",
    "IA0": "39,44",
    "ITV": "0,56",
    "IYV": "3,34",
    "ITD": "1,38",
    "IXD": "9,21",
    "delta": "0,01"
  },
  {
    "line": 25,
    "date": "12.10.",
    "name": "Korel",
    "style": "sun s otočkou",
    "video": "IMG_5738.MOV",
    "V0": "9,6510",
    "Y0": "2,01",
    "A0": "38,52",
    "TV": "0,61",
    "YV": "3,85",
    "TD": "1,50",
    "XD": "11,32",
    "IA0": "39,97",
    "ITV": "0,63",
    "IYV": "3,97",
    "ITD": "1,53",
    "IXD": "11,33",
    "delta": "0,01"
  },
  {
    "line": 26,
    "date": "12.10.",
    "name": "Ela",
    "style": "sun, přešlap",
    "video": "IMG_5739.MOV",
    "V0": "8,3806",
    "Y0": "1,87",
    "A0": "32,17",
    "TV": "0,46",
    "YV": "2,88",
    "TD": "1,22",
    "XD": "8,67",
    "IA0": "39,03",
    "ITV": "0,54",
    "IYV": "3,29",
    "ITD": "1,36",
    "IXD": "8,83",
    "delta": "0,17"
  },
  {
    "line": 27,
    "date": "12.10.",
    "name": "Valda",
    "style": "sun",
    "video": "IMG_5740.MOV",
    "V0": "7,0317",
    "Y0": "1,67",
    "A0": "35,84",
    "TV": "0,42",
    "YV": "2,53",
    "TD": "1,14",
    "XD": "6,49",
    "IA0": "37,81",
    "ITV": "0,44",
    "IYV": "2,61",
    "ITD": "1,17",
    "IXD": "6,50",
    "delta": "0,01"
  },
  {
    "line": 28,
    "date": "12.10.",
    "name": "Eliáš",
    "style": "sun",
    "video": "IMG_5741.MOV",
    "V0": "8,8132",
    "Y0": "1,65",
    "A0": "41,95",
    "TV": "0,60",
    "YV": "3,42",
    "TD": "1,44",
    "XD": "9,41",
    "IA0": "40,03",
    "ITV": "0,58",
    "IYV": "3,29",
    "ITD": "1,40",
    "IXD": "9,43",
    "delta": "0,02"
  },
  {
    "line": 29,
    "date": "12.10.",
    "name": "Vojta",
    "style": "sun, přešlap",
    "video": "IMG_5742.MOV",
    "V0": "8,2248",
    "Y0": "2,00",
    "A0": "45,63",
    "TV": "0,60",
    "YV": "3,76",
    "TD": "1,48",
    "XD": "8,48",
    "IA0": "38,51",
    "ITV": "0,52",
    "IYV": "3,33",
    "ITD": "1,35",
    "IXD": "8,67",
    "delta": "0,18"
  },
  {
    "line": 30,
    "date": "27.2.",
    "name": "Valda",
    "style": "z místa",
    "video": "IMG_7493.MOV",
    "V0": "7,1896",
    "Y0": "1,70",
    "A0": "26,29",
    "TV": "0,32",
    "YV": "2,21",
    "TD": "1,00",
    "XD": "6,42",
    "IA0": "37,95",
    "ITV": "0,45",
    "IYV": "2,69",
    "ITD": "1,19",
    "IXD": "6,76",
    "delta": "0,33"
  },
  {
    "line": 31,
    "date": "27.2.",
    "name": "Ela",
    "style": "z místa",
    "video": "IMG_7494.MOV",
    "V0": "8,6833",
    "Y0": "1,84",
    "A0": "30,55",
    "TV": "0,45",
    "YV": "2,84",
    "TD": "1,21",
    "XD": "9,05",
    "IA0": "39,42",
    "ITV": "0,56",
    "IYV": "3,39",
    "ITD": "1,39",
    "IXD": "9,35",
    "delta": "0,30"
  },
  {
    "line": 32,
    "date": "27.2.",
    "name": "Valda",
    "style": "z místa",
    "video": "IMG_7495.MOV",
    "V0": "7,2631",
    "Y0": "1,81",
    "A0": "32,63",
    "TV": "0,40",
    "YV": "2,59",
    "TD": "1,13",
    "XD": "6,89",
    "IA0": "37,71",
    "ITV": "0,45",
    "IYV": "2,81",
    "ITD": "1,21",
    "IXD": "6,96",
    "delta": "0,07"
  },
  {
    "line": 33,
    "date": "27.2.",
    "name": "Ela",
    "style": "z místa",
    "video": "IMG_7496.MOV",
    "V0": "8,5870",
    "Y0": "1,68",
    "A0": "26,72",
    "TV": "0,39",
    "YV": "2,44",
    "TD": "1,10",
    "XD": "8,43",
    "IA0": "39,74",
    "ITV": "0,56",
    "IYV": "3,21",
    "ITD": "1,37",
    "IXD": "9,04",
    "delta": "0,61"
  },
  {
    "line": 34,
    "date": "27.2.",
    "name": "Valda",
    "style": "z místa",
    "video": "IMG_7497.MOV",
    "V0": "7,1719",
    "Y0": "1,65",
    "A0": "33,90",
    "TV": "0,41",
    "YV": "2,47",
    "TD": "1,12",
    "XD": "6,65",
    "IA0": "38,07",
    "ITV": "0,45",
    "IYV": "2,65",
    "ITD": "1,19",
    "IXD": "6,70",
    "delta": "0,05"
  },
  {
    "line": 35,
    "date": "27.2.",
    "name": "Ela",
    "style": "z místa",
    "video": "IMG_7498.MOV",
    "V0": "8,8649",
    "Y0": "1,77",
    "A0": "21,55",
    "TV": "0,33",
    "YV": "2,31",
    "TD": "1,02",
    "XD": "8,40",
    "IA0": "39,79",
    "ITV": "0,58",
    "IYV": "3,41",
    "ITD": "1,41",
    "IXD": "9,62",
    "delta": "1,22"
  },
  {
    "line": 36,
    "date": "27.2.",
    "name": "Vojta",
    "style": "z místa",
    "video": "IMG_7502.MOV",
    "V0": "8,1785",
    "Y0": "1,82",
    "A0": "35,21",
    "TV": "0,48",
    "YV": "2,95",
    "TD": "1,26",
    "XD": "8,40",
    "IA0": "38,93",
    "ITV": "0,52",
    "IYV": "3,16",
    "ITD": "1,33",
    "IXD": "8,44",
    "delta": "0,05"
  },
  {
    "line": 37,
    "date": "27.2.",
    "name": "Vojta",
    "style": "z místa",
    "video": "IMG_7503.MOV",
    "V0": "8,2280",
    "Y0": "1,96",
    "A0": "34,22",
    "TV": "0,47",
    "YV": "3,05",
    "TD": "1,26",
    "XD": "8,58",
    "IA0": "38,61",
    "ITV": "0,52",
    "IYV": "3,30",
    "ITD": "1,34",
    "IXD": "8,64",
    "delta": "0,07"
  },
  {
    "line": 38,
    "date": "27.2.",
    "name": "Ela",
    "style": "sun",
    "video": "IMG_7504.MOV",
    "V0": "7,7484",
    "Y0": "1,71",
    "A0": "40,52",
    "TV": "0,51",
    "YV": "3,01",
    "TD": "1,30",
    "XD": "7,64",
    "IA0": "38,68",
    "ITV": "0,49",
    "IYV": "2,91",
    "ITD": "1,26",
    "IXD": "7,65",
    "delta": "0,01"
  },
  {
    "line": 39,
    "date": "27.2.",
    "name": "Valda",
    "style": "sun",
    "video": "IMG_7505.MOV",
    "V0": "7,5069",
    "Y0": "1,66",
    "A0": "30,04",
    "TV": "0,38",
    "YV": "2,38",
    "TD": "1,08",
    "XD": "7,02",
    "IA0": "38,52",
    "ITV": "0,48",
    "IYV": "2,77",
    "ITD": "1,23",
    "IXD": "7,22",
    "delta": "0,20"
  },
  {
    "line": 40,
    "date": "27.2.",
    "name": "Ela",
    "style": "sun",
    "video": "IMG_7506.MOV",
    "V0": "8,8235",
    "Y0": "1,77",
    "A0": "26,99",
    "TV": "0,41",
    "YV": "2,59",
    "TD": "1,13",
    "XD": "8,92",
    "IA0": "39,75",
    "ITV": "0,58",
    "IYV": "3,39",
    "ITD": "1,41",
    "IXD": "9,55",
    "delta": "0,62"
  },
  {
    "line": 41,
    "date": "27.2.",
    "name": "Valda",
    "style": "z místa",
    "video": "IMG_7507.MOV",
    "V0": "7,2925",
    "Y0": "1,79",
    "A0": "32,77",
    "TV": "0,40",
    "YV": "2,58",
    "TD": "1,13",
    "XD": "6,92",
    "IA0": "37,82",
    "ITV": "0,46",
    "IYV": "2,81",
    "ITD": "1,21",
    "IXD": "6,99",
    "delta": "0,07"
  },
  {
    "line": 42,
    "date": "27.2.",
    "name": "Vojta",
    "style": "z místa",
    "video": "IMG_7509.MOV",
    "V0": "8,4224",
    "Y0": "1,82",
    "A0": "28,34",
    "TV": "0,41",
    "YV": "2,63",
    "TD": "1,14",
    "XD": "8,45",
    "IA0": "39,21",
    "ITV": "0,54",
    "IYV": "3,26",
    "ITD": "1,36",
    "IXD": "8,87",
    "delta": "0,41"
  },
  {
    "line": 43,
    "date": "27.2.",
    "name": "Vojta",
    "style": "z místa",
    "video": "IMG_7510.MOV",
    "V0": "8,2740",
    "Y0": "1,87",
    "A0": "37,49",
    "TV": "0,51",
    "YV": "3,16",
    "TD": "1,32",
    "XD": "8,64",
    "IA0": "38,91",
    "ITV": "0,53",
    "IYV": "3,24",
    "ITD": "1,34",
    "IXD": "8,65",
    "delta": "0,01"
  }
]
