

how to boil an egg
==================

this tutorial shows you how to boil an egg the best way possible


variant 1
---------

 1. take egg

 1. put it in a pot full of water

 1. place pot onto stove

 1. turn on stove

 1. wait
    
     *  for soft-boiled, wait 3 minutes
        
         1. wait first minute
        
         1. wait second minute
        
         1. wait third minute
    
     *  for hard-boiled, wait 10 minutes

 1. turn off the stove

 1. replace water with cold water

 1. break and replace shell from the egg


variant 1
---------

 1. start your favorite browser

 1. open youtube:
    
        https://www.youtube.com/

 1. enter following text in Search box:
    
        how to boil an egg

 1. watch at least 5 videos

 1. go to the closest restaurant and ask for a boiled egg


conclusion
----------

We hope you enjoy the egg. Seriously.


references
----------

This is what fsumsal said about it:
> 
> OK.  I feel honored by inclusion in the test.

A more thorough review by mr. knowitalmostall:
> 
> The egg was good, except
> 
>  *  the shell could have been softer,
> 
>  *  the yolk could have been harder,
> 
>  *  the white could have been yellower.
> 
> Overall, I liked it.

(It's worth noting that mr. knowitalmostall does not work in the egg
review business anymore.)
