[0000-00-00T00:00:00+00:00] run.INFO: test.id: jats://test.example.com/adept/mypkg//unit/basic
[0000-00-00T00:00:00+00:00] run.INFO: test.version: 0.0.0
[0000-00-00T00:00:00+00:00] run.INFO: test.code: http://code.example.com//mypkg/0.0.0/unit/basic/
[0000-00-00T00:00:00+00:00] run.INFO: test.doc: http://doc.example.com//mypkg/0.0.0/suite.html#unit-basic
[0000-00-00T00:00:00+00:00] run.START
[0000-00-00T00:00:00+00:00] 
[0000-00-00T00:00:00+00:00] test.INFO: nothing is done here
[0000-00-00T00:00:00+00:00] run.FINALIZE
