[0000-00-00T00:00:00+00:00] run.INFO: test.id: _jat_anon_test_
[0000-00-00T00:00:00+00:00] run.INFO: test.version: _jat_no_test_version_
[0000-00-00T00:00:00+00:00] run.START
[0000-00-00T00:00:00+00:00] 
[0000-00-00T00:00:00+00:00] phase.START [pfpff_1of4] pfpff: phase 1/4 # setup
[0000-00-00T00:00:00+00:00]   assert.PASS: true
[0000-00-00T00:00:00+00:00]   assert.INFO: exit status did not match: 1 !~ 0
[0000-00-00T00:00:00+00:00]   assert.INFO:  .. exit status oracle: 0
[0000-00-00T00:00:00+00:00]   assert.INFO:  .. exit status: 1
[0000-00-00T00:00:00+00:00]   assert.INFO:  .. duration: 0
[0000-00-00T00:00:00+00:00]   assert.INFO:  .. command (unquoted here): false
[0000-00-00T00:00:00+00:00]   assert.FAIL: false
[0000-00-00T00:00:00+00:00] phase.END.FAIL (d=0) [pfpff_1of4] pfpff: phase 1/4 # setup
[0000-00-00T00:00:00+00:00] 
[0000-00-00T00:00:00+00:00] phase.START [pfpff_2of4] pfpff: phase 2/4 # test
[0000-00-00T00:00:00+00:00]   assert.PASS: true
[0000-00-00T00:00:00+00:00] phase.END.PASS (d=0) [pfpff_2of4] pfpff: phase 2/4 # test
[0000-00-00T00:00:00+00:00] 
[0000-00-00T00:00:00+00:00] phase.START [pfpff_3of4] pfpff: phase 3/4 # diag
[0000-00-00T00:00:00+00:00]   assert.INFO: exit status did not match: 1 !~ 0
[0000-00-00T00:00:00+00:00]   assert.INFO:  .. exit status oracle: 0
[0000-00-00T00:00:00+00:00]   assert.INFO:  .. exit status: 1
[0000-00-00T00:00:00+00:00]   assert.INFO:  .. duration: 0
[0000-00-00T00:00:00+00:00]   assert.INFO:  .. command (unquoted here): false
[0000-00-00T00:00:00+00:00]   assert.FAIL: false
[0000-00-00T00:00:00+00:00] phase.END.FAIL (d=0) [pfpff_3of4] pfpff: phase 3/4 # diag
[0000-00-00T00:00:00+00:00] 
[0000-00-00T00:00:00+00:00] phase.START [pfpff_4of4] pfpff: phase 4/4 # cleanup
[0000-00-00T00:00:00+00:00]   assert.INFO: exit status did not match: 1 !~ 0
[0000-00-00T00:00:00+00:00]   assert.INFO:  .. exit status oracle: 0
[0000-00-00T00:00:00+00:00]   assert.INFO:  .. exit status: 1
[0000-00-00T00:00:00+00:00]   assert.INFO:  .. duration: 0
[0000-00-00T00:00:00+00:00]   assert.INFO:  .. command (unquoted here): false
[0000-00-00T00:00:00+00:00]   assert.FAIL: false
[0000-00-00T00:00:00+00:00] phase.END.FAIL (d=0) [pfpff_4of4] pfpff: phase 4/4 # cleanup
[0000-00-00T00:00:00+00:00] 
[0000-00-00T00:00:00+00:00] test.INFO: =====BEGIN FILE meta.log=====
[0000-00-00T00:00:00+00:00] test.INFO: 0: rasrtc=1 rpassc=1 rfailc=0 pasrtc=1 ppassc=1 pfailc=0 bcaseid=_jat_anon_test_:pfpff_1of4 phint="pfpff: phase 1/4" ptype=setup
[0000-00-00T00:00:00+00:00] test.INFO: 1: rasrtc=2 rpassc=1 rfailc=1 pasrtc=2 ppassc=1 pfailc=1 bcaseid=_jat_anon_test_:pfpff_1of4 phint="pfpff: phase 1/4" ptype=setup
[0000-00-00T00:00:00+00:00] test.INFO: 2: rasrtc=2 rpassc=1 rfailc=1 pasrtc=0 ppassc=0 pfailc=0 bcaseid=_jat_anon_test_ phint="" ptype=
[0000-00-00T00:00:00+00:00] test.INFO: 3: rasrtc=3 rpassc=2 rfailc=1 pasrtc=1 ppassc=1 pfailc=0 bcaseid=_jat_anon_test_:pfpff_2of4 phint="pfpff: phase 2/4" ptype=test
[0000-00-00T00:00:00+00:00] test.INFO: 4: rasrtc=3 rpassc=2 rfailc=1 pasrtc=0 ppassc=0 pfailc=0 bcaseid=_jat_anon_test_ phint="" ptype=
[0000-00-00T00:00:00+00:00] test.INFO: 5: rasrtc=4 rpassc=2 rfailc=2 pasrtc=1 ppassc=0 pfailc=1 bcaseid=_jat_anon_test_:pfpff_3of4 phint="pfpff: phase 3/4" ptype=diag
[0000-00-00T00:00:00+00:00] test.INFO: 6: rasrtc=4 rpassc=2 rfailc=2 pasrtc=0 ppassc=0 pfailc=0 bcaseid=_jat_anon_test_ phint="" ptype=
[0000-00-00T00:00:00+00:00] test.INFO: 7: rasrtc=5 rpassc=2 rfailc=3 pasrtc=1 ppassc=0 pfailc=1 bcaseid=_jat_anon_test_:pfpff_4of4 phint="pfpff: phase 4/4" ptype=cleanup
[0000-00-00T00:00:00+00:00] test.INFO: 8: rasrtc=5 rpassc=2 rfailc=3 pasrtc=0 ppassc=0 pfailc=0 bcaseid=_jat_anon_test_ phint="" ptype=
[0000-00-00T00:00:00+00:00] test.INFO: =====END FILE meta.log=====
[0000-00-00T00:00:00+00:00] run.FINALIZE.FAIL
