_jat_anon_test_
0
---
format: jat/0.0
jat_version: JAT_VERSION
test:
    id: _jat_anon_test_
    version: _jat_no_test_version_
start: time-1
id: noid
events:
    -
        etype: RUN.START
        stamp: time-2
    -
        etype: PHASE.START
        stamp: time-3
        phase:
            id: phasid-1
            type: test
            hint: |-4
                jat__cmd() usages
        data:
            pcaseid: ~
            pdir: ~
    -
        etype: MESSAGE.ERROR
        stamp: time-4
        message: |-4
            bad usage: jat__cmd(): no CMD?
              usage: jat__cmd [assert-options] [-o R_OUT] [-e R_ERR] [-s R_ESF] [-S ES_EXPR] [-V ES_EXPR] [--] CMD [ARG]..
        data: {}
    -
        etype: MESSAGE.ERROR
        stamp: time-5
        message: |-4
            bad usage: jat__cmd(): unknown argument: -X
              usage: jat__cmd [assert-options] [-o R_OUT] [-e R_ERR] [-s R_ESF] [-S ES_EXPR] [-V ES_EXPR] [--] CMD [ARG]..
        data: {}
    -
        etype: MESSAGE.ERROR
        stamp: time-6
        message: |-4
            bad usage: jat__cmd(): unknown argument: --unknown-arg
              usage: jat__cmd [assert-options] [-o R_OUT] [-e R_ERR] [-s R_ESF] [-S ES_EXPR] [-V ES_EXPR] [--] CMD [ARG]..
        data: {}
    -
        etype: ASSERT.PASS
        stamp: time-7
        hint: |-4
            true
        caseid: |-4
            _jat_anon_test_
        data:
            t.cmd: |-4
                true
            o.es_expr: |-4
                0
            r.es: |-4
                0
            r.duration: |-4
                0
    -
        etype: PHASE.END
        stamp: time-8
        phase:
            duration: 0
    -
        etype: PHASE.START
        stamp: time-9
        phase:
            id: phasid-2
            type: test
            hint: |-4
                jat__eval() usages
        data:
            pcaseid: ~
            pdir: ~
    -
        etype: MESSAGE.ERROR
        stamp: time-10
        message: |-4
            bad usage: jat__eval(): no CODE?
              usage: jat__eval [assert-options] [-o R_OUT] [-e R_ERR] [-s R_ESF] [-S ES_EXPR] [-V ES_EXPR] [--] CODE
        data: {}
    -
        etype: MESSAGE.ERROR
        stamp: time-11
        message: |-4
            bad usage: jat__eval(): unknown argument: -X
              usage: jat__eval [assert-options] [-o R_OUT] [-e R_ERR] [-s R_ESF] [-S ES_EXPR] [-V ES_EXPR] [--] CODE
        data: {}
    -
        etype: MESSAGE.ERROR
        stamp: time-12
        message: |-4
            bad usage: jat__eval(): unknown argument: --unknown-arg
              usage: jat__eval [assert-options] [-o R_OUT] [-e R_ERR] [-s R_ESF] [-S ES_EXPR] [-V ES_EXPR] [--] CODE
        data: {}
    -
        etype: ASSERT.PASS
        stamp: time-13
        hint: |-4
            true
        caseid: |-4
            _jat_anon_test_
        data:
            t.code: |-4
                true
            o.es_expr: |-4
                0
            r.es: |-4
                0
            r.duration: |-4
                0
    -
        etype: PHASE.END
        stamp: time-14
        phase:
            duration: 0
    -
        etype: PHASE.START
        stamp: time-15
        phase:
            id: phasid-3
            type: test
            hint: |-4
                jat__cmp() usages
        data:
            pcaseid: ~
            pdir: ~
    -
        etype: MESSAGE.ERROR
        stamp: time-16
        message: |-4
            bad usage: jat__cmp(): no RVAL?
              usage: jat__cmp [assert-options] RVAL OP OVAL
        data: {}
    -
        etype: MESSAGE.ERROR
        stamp: time-17
        message: |-4
            bad usage: jat__cmp(): too many arguments!
              usage: jat__cmp [assert-options] RVAL OP OVAL
        data: {}
    -
        etype: MESSAGE.ERROR
        stamp: time-18
        message: |-4
            bad usage: jat__cmp(): too many arguments!
              usage: jat__cmp [assert-options] RVAL OP OVAL
        data: {}
    -
        etype: MESSAGE.ERROR
        stamp: time-19
        message: |-4
            bad usage: jat__cmp(): bad syntax: 1 unknown_op 1
              usage: jat__cmp [assert-options] RVAL OP OVAL
        data: {}
    -
        etype: ASSERT.PASS
        stamp: time-20
        hint: |-4
            1 eq 1
        caseid: |-4
            _jat_anon_test_
        data:
            r.val: |-4
                1
            t.op: |-4
                eq
            o.val: |-4
                1
    -
        etype: PHASE.END
        stamp: time-21
        phase:
            duration: 0
    -
        etype: PHASE.START
        stamp: time-22
        phase:
            id: phasid-4
            type: test
            hint: |-4
                jat__pass() usages
        data:
            pcaseid: ~
            pdir: ~
    -
        etype: MESSAGE.ERROR
        stamp: time-23
        message: |-4
            bad usage: jat__pass(): extra arguments: FOO
              usage: jat__pass [assert-options]
        data: {}
    -
        etype: MESSAGE.ERROR
        stamp: time-24
        message: |-4
            bad usage: jat__pass(): extra arguments: -X
              usage: jat__pass [assert-options]
        data: {}
    -
        etype: MESSAGE.ERROR
        stamp: time-25
        message: |-4
            bad usage: jat__pass(): extra arguments: --unknown-arg
              usage: jat__pass [assert-options]
        data: {}
    -
        etype: ASSERT.PASS
        stamp: time-26
        hint: ~
        caseid: |-4
            _jat_anon_test_
        data: {}
    -
        etype: PHASE.END
        stamp: time-27
        phase:
            duration: 0
    -
        etype: PHASE.START
        stamp: time-28
        phase:
            id: phasid-5
            type: test
            hint: |-4
                jat__fail() usages
        data:
            pcaseid: ~
            pdir: ~
    -
        etype: MESSAGE.ERROR
        stamp: time-29
        message: |-4
            bad usage: jat__fail(): extra arguments: FOO
              usage: jat__fail [assert-options]
        data: {}
    -
        etype: MESSAGE.ERROR
        stamp: time-30
        message: |-4
            bad usage: jat__fail(): extra arguments: -X
              usage: jat__fail [assert-options]
        data: {}
    -
        etype: MESSAGE.ERROR
        stamp: time-31
        message: |-4
            bad usage: jat__fail(): extra arguments: --unknown-arg
              usage: jat__fail [assert-options]
        data: {}
    -
        etype: ASSERT.FAIL
        stamp: time-32
        hint: ~
        caseid: |-4
            _jat_anon_test_
        data: {}
    -
        etype: PHASE.END
        stamp: time-33
        phase:
            duration: 0
    -
        etype: PHASE.START
        stamp: time-34
        phase:
            id: phasid-6
            type: test
            hint: |-4
                jat__log_*() usages
        data:
            pcaseid: ~
            pdir: ~
    -
        etype: MESSAGE.ERROR
        stamp: time-35
        message: ~
        data: {}
    -
        etype: MESSAGE.ERROR
        stamp: time-36
        message: |-4
            FOO
        data: {}
    -
        etype: MESSAGE.ERROR
        stamp: time-37
        message: ~
        data: {}
    -
        etype: MESSAGE.ERROR
        stamp: time-38
        message: |-4
            MY_VAR="val"
        data: {}
    -
        etype: MESSAGE.INFO
        stamp: time-39
        message: ~
        data: {}
    -
        etype: MESSAGE.INFO
        stamp: time-40
        message: |-4
            FOO
        data: {}
    -
        etype: MESSAGE.INFO
        stamp: time-41
        message: ~
        data: {}
    -
        etype: MESSAGE.INFO
        stamp: time-42
        message: |-4
            MY_VAR="val"
        data: {}
    -
        etype: MESSAGE.WARNING
        stamp: time-43
        message: ~
        data: {}
    -
        etype: MESSAGE.WARNING
        stamp: time-44
        message: |-4
            FOO
        data: {}
    -
        etype: MESSAGE.WARNING
        stamp: time-45
        message: ~
        data: {}
    -
        etype: MESSAGE.WARNING
        stamp: time-46
        message: |-4
            MY_VAR="val"
        data: {}
    -
        etype: PHASE.END
        stamp: time-47
        phase:
            duration: 0
    -
        etype: PHASE.START
        stamp: time-48
        phase:
            id: phasid-7
            type: test
            hint: |-4
                jat__meta() usages
        data:
            pcaseid: ~
            pdir: ~
    -
        etype: MESSAGE.ERROR
        stamp: time-49
        message: |-4
            bad usage: jat__meta(): invalid meta-data field: 
              usage: jat__meta bcaseid
              usage: jat__meta ptype
        data: {}
    -
        etype: MESSAGE.ERROR
        stamp: time-50
        message: |-4
            bad usage: jat__meta(): invalid meta-data field: -X
              usage: jat__meta bcaseid
              usage: jat__meta ptype
        data: {}
    -
        etype: MESSAGE.ERROR
        stamp: time-51
        message: |-4
            bad usage: jat__meta(): invalid meta-data field: --unknown-arg
              usage: jat__meta bcaseid
              usage: jat__meta ptype
        data: {}
    -
        etype: MESSAGE.ERROR
        stamp: time-52
        message: |-4
            bad usage: jat__meta(): invalid meta-data field: unknown_field
              usage: jat__meta bcaseid
              usage: jat__meta ptype
        data: {}
    -
        etype: PHASE.END
        stamp: time-53
        phase:
            duration: 0
    -
        etype: PHASE.START
        stamp: time-54
        phase:
            id: phasid-8
            type: test
            hint: |-4
                jat__stat() usages
        data:
            pcaseid: ~
            pdir: ~
    -
        etype: MESSAGE.ERROR
        stamp: time-55
        message: |-4
            bad usage: jat__stat(): invalid statistic field: 
              usage: jat__stat rpassc
              usage: jat__stat rfailc
              usage: jat__stat ppassc
              usage: jat__stat pfailc
              usage: jat__stat ..
        data: {}
    -
        etype: MESSAGE.ERROR
        stamp: time-56
        message: |-4
            bad usage: jat__stat(): invalid statistic field: -X
              usage: jat__stat rpassc
              usage: jat__stat rfailc
              usage: jat__stat ppassc
              usage: jat__stat pfailc
              usage: jat__stat ..
        data: {}
    -
        etype: MESSAGE.ERROR
        stamp: time-57
        message: |-4
            bad usage: jat__stat(): invalid statistic field: --unknown-arg
              usage: jat__stat rpassc
              usage: jat__stat rfailc
              usage: jat__stat ppassc
              usage: jat__stat pfailc
              usage: jat__stat ..
        data: {}
    -
        etype: MESSAGE.ERROR
        stamp: time-58
        message: |-4
            bad usage: jat__stat(): invalid statistic field: unknown_field
              usage: jat__stat rpassc
              usage: jat__stat rfailc
              usage: jat__stat ppassc
              usage: jat__stat pfailc
              usage: jat__stat ..
        data: {}
    -
        etype: PHASE.END
        stamp: time-59
        phase:
            duration: 0
    -
        etype: PHASE.START
        stamp: time-60
        phase:
            id: phasid-9
            type: test
            hint: |-4
                jat__seen() usages
        data:
            pcaseid: ~
            pdir: ~
    -
        etype: MESSAGE.ERROR
        stamp: time-61
        message: |-4
            bad usage: jat__seen(): invalid statistic field: 
              usage: jat__seen rfail
              usage: jat__seen pfail
              usage: jat__seen rerr
              usage: jat__seen ..
        data: {}
    -
        etype: MESSAGE.ERROR
        stamp: time-62
        message: |-4
            bad usage: jat__seen(): invalid statistic field: -X
              usage: jat__seen rfail
              usage: jat__seen pfail
              usage: jat__seen rerr
              usage: jat__seen ..
        data: {}
    -
        etype: MESSAGE.ERROR
        stamp: time-63
        message: |-4
            bad usage: jat__seen(): invalid statistic field: --unknown-arg
              usage: jat__seen rfail
              usage: jat__seen pfail
              usage: jat__seen rerr
              usage: jat__seen ..
        data: {}
    -
        etype: MESSAGE.ERROR
        stamp: time-64
        message: |-4
            bad usage: jat__seen(): invalid statistic field: unknown_field
              usage: jat__seen rfail
              usage: jat__seen pfail
              usage: jat__seen rerr
              usage: jat__seen ..
        data: {}
    -
        etype: PHASE.END
        stamp: time-65
        phase:
            duration: 0
    -
        etype: MESSAGE.ERROR
        stamp: time-66
        message: |-4
            bad usage: jat__pstarts(): 
              usage: jat__pstarts [phase-options]
        data: {}
    -
        etype: PHASE.START
        stamp: time-67
        phase:
            id: phasid-10
            type: setup
            hint: |-4
                some hint
        data:
            pcaseid: ~
            pdir: ~
    -
        etype: ASSERT.PASS
        stamp: time-68
        hint: ~
        caseid: |-4
            _jat_anon_test_
        data: {}
    -
        etype: PHASE.END
        stamp: time-69
        phase:
            duration: 0
    -
        etype: MESSAGE.ERROR
        stamp: time-70
        message: |-4
            bad usage: jat__pstartt(): 
              usage: jat__pstartt [phase-options]
        data: {}
    -
        etype: PHASE.START
        stamp: time-71
        phase:
            id: phasid-11
            type: test
            hint: |-4
                
        data:
            pcaseid: ~
            pdir: ~
    -
        etype: ASSERT.PASS
        stamp: time-72
        hint: ~
        caseid: |-4
            _jat_anon_test_
        data: {}
    -
        etype: PHASE.END
        stamp: time-73
        phase:
            duration: 0
    -
        etype: MESSAGE.ERROR
        stamp: time-74
        message: |-4
            bad usage: jat__pstartd(): 
              usage: jat__pstartd [phase-options]
        data: {}
    -
        etype: PHASE.START
        stamp: time-75
        phase:
            id: phasid-12
            type: diag
            hint: |-4
                
        data:
            pcaseid: ~
            pdir: ~
    -
        etype: ASSERT.PASS
        stamp: time-76
        hint: ~
        caseid: |-4
            _jat_anon_test_
        data: {}
    -
        etype: PHASE.END
        stamp: time-77
        phase:
            duration: 0
    -
        etype: MESSAGE.ERROR
        stamp: time-78
        message: |-4
            bad usage: jat__pstartc(): 
              usage: jat__pstartc [phase-options]
        data: {}
    -
        etype: PHASE.START
        stamp: time-79
        phase:
            id: phasid-13
            type: cleanup
            hint: |-4
                
        data:
            pcaseid: ~
            pdir: ~
    -
        etype: ASSERT.PASS
        stamp: time-80
        hint: ~
        caseid: |-4
            _jat_anon_test_
        data: {}
    -
        etype: PHASE.END
        stamp: time-81
        phase:
            duration: 0
    -
        etype: PHASE.START
        stamp: time-82
        phase:
            id: phasid-14
            type: test
            hint: |-4
                
        data:
            pcaseid: ~
            pdir: ~
    -
        etype: ASSERT.PASS
        stamp: time-83
        hint: ~
        caseid: |-4
            _jat_anon_test_
        data: {}
    -
        etype: MESSAGE.ERROR
        stamp: time-84
        message: |-4
            bad usage: jat__pend(): unknown argument: YAH
              usage: jat__pend [-W]
        data: {}
    -
        etype: PHASE.END
        stamp: time-85
        phase:
            duration: 0
    -
        etype: PHASE.START
        stamp: time-86
        phase:
            id: phasid-15
            type: test
            hint: |-4
                
        data:
            pcaseid: ~
            pdir: ~
    -
        etype: ASSERT.PASS
        stamp: time-87
        hint: ~
        caseid: |-4
            _jat_anon_test_
        data: {}
    -
        etype: MESSAGE.ERROR
        stamp: time-88
        message: |-4
            bad usage: jat__pend(): unknown argument: -X
              usage: jat__pend [-W]
        data: {}
    -
        etype: PHASE.END
        stamp: time-89
        phase:
            duration: 0
    -
        etype: PHASE.START
        stamp: time-90
        phase:
            id: phasid-16
            type: test
            hint: |-4
                
        data:
            pcaseid: ~
            pdir: ~
    -
        etype: ASSERT.PASS
        stamp: time-91
        hint: ~
        caseid: |-4
            _jat_anon_test_
        data: {}
    -
        etype: MESSAGE.ERROR
        stamp: time-92
        message: |-4
            bad usage: jat__pend(): unknown argument: --unknown-arg
              usage: jat__pend [-W]
        data: {}
    -
        etype: PHASE.END
        stamp: time-93
        phase:
            duration: 0
    -
        etype: PHASE.START
        stamp: time-94
        phase:
            id: phasid-17
            type: test
            hint: |-4
                jat__submit() usages
        data:
            pcaseid: ~
            pdir: ~
    -
        etype: MESSAGE.ERROR
        stamp: time-95
        message: |-4
            bad usage: jat__submit(): no SRC?
              usage: jat__submit [-s] [-h HINT] [-H] SRC [ALTNAME]
        data: {}
    -
        etype: MESSAGE.WARNING
        stamp: time-96
        message: |-4
            result submission failed locally
        data: {}
    -
        etype: MESSAGE.WARNING
        stamp: time-97
        message: |-4
            result submission failed locally
        data: {}
    -
        etype: PHASE.END
        stamp: time-98
        phase:
            duration: 0
    -
        etype: PHASE.START
        stamp: time-99
        phase:
            id: phasid-18
            type: test
            hint: |-4
                jat__submitb() usages
        data:
            pcaseid: ~
            pdir: ~
    -
        etype: MESSAGE.ERROR
        stamp: time-100
        message: |-4
            bad usage: jat__submitb(): no BALLNAME?
              usage: jat__submitb [-s] [-h HINT] [-H] [-C CHDIR] BALLNAME PATH..
        data: {}
    -
        etype: MESSAGE.ERROR
        stamp: time-101
        message: |-4
            bad usage: jat__submitb(): no PATH?
              usage: jat__submitb [-s] [-h HINT] [-H] [-C CHDIR] BALLNAME PATH..
        data: {}
    -
        etype: MESSAGE.ERROR
        stamp: time-102
        message: |-4
            bad usage: jat__submitb(): no PATH?
              usage: jat__submitb [-s] [-h HINT] [-H] [-C CHDIR] BALLNAME PATH..
        data: {}
    -
        etype: PHASE.END
        stamp: time-103
        phase:
            duration: 0
    -
        etype: PHASE.START
        stamp: time-104
        phase:
            id: phasid-19
            type: test
            hint: |-4
                jat__submitc() usages
        data:
            pcaseid: ~
            pdir: ~
    -
        etype: MESSAGE.ERROR
        stamp: time-105
        message: |-4
            bad usage: jat__submitc(): no CODE?
              usage: jat__submitc [-h HINT] [-H] [-C CHDIR] CMD [ARG]..
        data: {}
    -
        etype: MESSAGE.ERROR
        stamp: time-106
        message: |-4
            bad usage: jat__submitc(): no RELNAME?
              usage: jat__submitc [-h HINT] [-H] [-C CHDIR] CMD [ARG]..
        data: {}
    -
        etype: MESSAGE.ERROR
        stamp: time-107
        message: |-4
            bad usage: jat__submitc(): no RELNAME?
              usage: jat__submitc [-h HINT] [-H] [-C CHDIR] CMD [ARG]..
        data: {}
    -
        etype: PHASE.END
        stamp: time-108
        phase:
            duration: 0
    -
        etype: PHASE.START
        stamp: time-109
        phase:
            id: phasid-20
            type: test
            hint: |-4
                jat__submitn() usages
        data:
            pcaseid: ~
            pdir: ~
    -
        etype: MESSAGE.WARNING
        stamp: time-110
        message: |-4
            result submission failed locally
        data: {}
    -
        etype: MESSAGE.WARNING
        stamp: time-111
        message: |-4
            result submission failed locally
        data: {}
    -
        etype: PHASE.END
        stamp: time-112
        phase:
            duration: 0
    -
        etype: PHASE.START
        stamp: time-113
        phase:
            id: phasid-21
            type: test
            hint: |-4
                jat__filebackup() usages
        data:
            pcaseid: ~
            pdir: ~
    -
        etype: MESSAGE.ERROR
        stamp: time-114
        message: |-4
            bad usage: jat__filebackup(): no PATH?
        data: {}
    -
        etype: MESSAGE.ERROR
        stamp: time-115
        message: |-4
            bad usage: jat__filebackup(): no NS?
        data: {}
    -
        etype: MESSAGE.ERROR
        stamp: time-116
        message: |-4
            bad usage: jat__filebackup(): unknown argument: -X
        data: {}
    -
        etype: MESSAGE.ERROR
        stamp: time-117
        message: |-4
            bad usage: jat__filebackup(): unknown argument: --unknown-arg
        data: {}
    -
        etype: PHASE.END
        stamp: time-118
        phase:
            duration: 0
    -
        etype: PHASE.START
        stamp: time-119
        phase:
            id: phasid-22
            type: test
            hint: |-4
                jat__filerestore() usages
        data:
            pcaseid: ~
            pdir: ~
    -
        etype: MESSAGE.ERROR
        stamp: time-120
        message: |-4
            bad usage: jat__filerestore(): no NS?
        data: {}
    -
        etype: MESSAGE.ERROR
        stamp: time-121
        message: |-4
            bad usage: jat__filerestore(): unknown argument: -X
        data: {}
    -
        etype: MESSAGE.ERROR
        stamp: time-122
        message: |-4
            bad usage: jat__filerestore(): unknown argument: --unknown-arg
        data: {}
    -
        etype: PHASE.END
        stamp: time-123
        phase:
            duration: 0
    -
        etype: RUN.END
        stamp: time-124
finalized: true
end: time-125
