[0000-00-00T00:00:00+00:00] run.INFO: test.id: _jat_anon_test_
[0000-00-00T00:00:00+00:00] run.INFO: test.version: _jat_no_test_version_
[0000-00-00T00:00:00+00:00] run.START
[0000-00-00T00:00:00+00:00] 
[0000-00-00T00:00:00+00:00] phase.START [heya] # test
[0000-00-00T00:00:00+00:00]   assert.PASS: true
[0000-00-00T00:00:00+00:00] phase.END.PASS (d=0) [heya] # test
[0000-00-00T00:00:00+00:00] 
[0000-00-00T00:00:00+00:00] phase.START # test
[0000-00-00T00:00:00+00:00]   assert.PASS: true
[0000-00-00T00:00:00+00:00] phase.END.PASS (d=0) # test
[0000-00-00T00:00:00+00:00] 
[0000-00-00T00:00:00+00:00] phase.START # test
[0000-00-00T00:00:00+00:00]   assert.PASS: true
[0000-00-00T00:00:00+00:00] phase.END.PASS (d=0) # test
[0000-00-00T00:00:00+00:00] 
[0000-00-00T00:00:00+00:00] test.ERROR: bad usage: jat__meta(): invalid meta-data field: junkyjunk
[0000-00-00T00:00:00+00:00] test.ERROR:   usage: jat__meta bcaseid
[0000-00-00T00:00:00+00:00] test.ERROR:   usage: jat__meta ptype
[0000-00-00T00:00:00+00:00] run.FINALIZE.ERROR
