{
  "Bug": {
    "browser": "Navigateur Internet",
    "browserVersion": "Version du navigateur",
    "form": "Erreur dans le formulaire",
    "message": "Message",
    "messageLength": "Le message doit être composé de 50 caractères minimum",
    "os": "Système d'exploitation",
    "send": "Envoyer le rapport",
    "sent": "Votre message a été envoyé avec succès. Nous vous répondrons dès que possible par e-mail",
    "wait": "Veuillez patienter une minute avant d'envoyer un nouveau rapport de bug."
  },

  "Dates": {
    "date": "DD/MM/YYYY",
    "time": "HH:mm"
  },

  "EndSubscriptionMail": {
    "subject": "VonaDrive - Votre abonnement se termine dans [days] jours",
    "message": "Bonjour [login],<br>Cet email vous est envoyé car votre abonnement se termine dans moins de [days] jours.<br>VonaDrive Team"
  },

  "InactiveUserMail": {
    "subject": "VonaDrive - Vous êtes inactif",
    "message": "Bonjour [login],<br>Cet email vous est envoyé car vous êtres inactif depuis [inactiveDays] jours.<br>Votre compte va être supprimé dans [deleteDelay] jours si vous ne vous connectez pas.<br>VonaDrive Team"
  },

  "Error": {
    "bannedSession": "Vous avez atteint le nombre maximum autorisé de requêtes",
    "default": "Une erreur est survenue",
    "dl": "Le téléchargement de fichiers n'est pas disponible dans votre navigateur.",
    "e404": "Erreur\u00a0: Page non trouvée",
    "form": "Erreur dans le formulaire",
    "pp": "Impossible de modifier votre phrase secrète pour le moment"
  },

  "Global": {
    "back": "Retour à VonaDrive",
    "bug": "Rapport de bug",
    "cancel": "Cancel",
    "home": "Accueil",
    "favorites": "Favoris",
    "loading": "Chargement...",
    "login": "Connexion",
    "logout": "Déconnexion",
    "mailSent": "Un email vous a été envoyé, veuillez vérifier votre boîte de réception et vos spams. Si vous n'avez rien reçu au bout de 5mn, tentez à nouveau\u00a0:",
    "recents": "Mui :: Récents",
    "refresh": "Actualiser",
    "register": "Inscription",
    "profile": "Profil",
    "shared": "Partagés",
    "sharing": "Mui :: Partage",
    "submit": "Valider",
    "transfers": "Transferts",
    "trash": "Corbeille",
    "upgrade": "Mettre à niveau",
    "validate": "Valider l'adresse email"
  },

  "Help": {
    "shortcuts": [
      "<strong>Version pour ordinateur de bureau</strong><ul>",
      "<li>Clic gauche sur un fichier/dossier\u00a0: Sélectionner un fichier/dossier - Voir les détails</li>",
      "<li>Clic gauche autre part\u00a0: Désélectionner</li>",
      "<li>Ctrl + Clic gauche\u00a0: Sélectionner plusieurs fichiers</li>",
      "<li>Clic droit\u00a0: Voir les actions</li>",
      "<li>Flèche haut\u00a0: Sélectionner fichier précédent</li>",
      "<li>Flèche bas\u00a0: Sélectionner fichier suivant</li>",
      "<li>Ctrl + Flèche haut\u00a0: Ajouter fichier précédent à la sélection</li>",
      "<li>Ctrl + Arrow down\u00a0: Ajouter fichier suivant à la sélection</li>",
      "<li>Ctrl + A\u00a0: Sélectionner tout</li>",
      "<li>Ctrl + C\u00a0: Copier</li>",
      "<li>Ctrl + D\u00a0: Déconnexion</li>",
      "<li>Ctrl + I\u00a0: Inverser sélection</li>",
      "<li>Ctrl + R\u00a0: Mettre à la corbeille</li>",
      "<li>Ctrl + S\u00a0: Sauvegarder sélection</li>",
      "<li>Ctrl + V\u00a0: Coller</li>",
      "<li>Ctrl + X\u00a0: Couper</li>",
      "<li>Retour Arrière\u00a0: Aller au dossier parent</li>",
      "<li>Suppr\u00a0: Supprimer sélection</li>",
      "<li>Echap\u00a0: Masquer les actions</li>",
      "<li>Entrée (sur un fichier)\u00a0: Télécharger</li>",
      "<li>Entrée (sur un dossier)\u00a0: Ouvrir dossier</li>",
      "<li>F1\u00a0: Aide</li></ul>"
    ]
  },

  "Login": {
    "backupCodes": "Codes de secours\u00a0:",
    "badPass": "Mauvais mot de passe\u00a0!",
    "badPassphrase": "Erreur\u00a0: phrase secrète incorrecte",
    "code": "Code reçu",
    "doubleAuthMessage": "Bonjour, votre code d'authentification est [key]<br>Cordialement,<br>L'équipe VonaDrive<br><br>Ce mail a été généré automatiquement, merci de ne pas y répondre.",
    "enterCodeEnable": "Une fois scanné, et afin d'activer Google Authenticator sur VonaDrive, vous devez entrer le code de vérification à 6 caractères\u00a0:",
    "enterCodePerform": "Pour effectuer cette action vous devez entrer le code de vérification à 6 caractères\u00a0:",
    "forgot": "Mot de passe oublié\u00a0?",
    "insecureHttp": "Vous ne pouvez pas utiliser l'API Server depuis HTTP lorsque le client a été chargé avec HTTPS",
    "invalidCode": "Le code entré est invalide",
    "manually": "Ou entrez le code manuellement\u00a0:",
    "regenerate": "Regénérer",
    "register": "Créer un compte VonaDrive.",
    "scan": "Installez <strong>Google Authenticator</strong> sur votre téléphone, et veuillez scanner ce QR Code afin d'obtenir votre code d'authentification\u00a0:",
    "showBackupCodes": "Afficher les codes de secours",
    "signIn": "Se connecter",
    "success": "Connexion réussie",
    "username": "Email ou nom d'utilisateur",
    "wait": "Veuillez patienter une minute avant d'envoyer un nouveau mail d'authentification.",
    "server": "Connexion à un autre serveur"
  },

  "LostPass": {
    "changePassword": "Attention\u00a0! Si vous changez votre mot de passe, vous perdrez toutes vos données stockées sur VonaDrive\u00a0!",
    "changeSecret": "Attention\u00a0! Si vous changez votre phrase secrète, vous perdrez toutes vos données stockées sur VonaDrive\u00a0!",
    "keyErr": "Erreur\u00a0: La clé est incorrecte ou expirée, veuillez refaire une demande de mot de passe perdu.",
    "losePassword": "Attention\u00a0! Si vous perdez votre mot de passe, vous perdrez toutes vos données stockées sur VonaDrive\u00a0!",
    "loseSecret": "Attention\u00a0! Si vous perdez votre phrase secrète, vous perdrez toutes vos données stockées sur VonaDrive\u00a0!",
    "message": "Bonjour,<br>Afin de modifier votre mot de passe ou votre phrase secrète, veuillez suivre ce lien&nbsp;: <a href='[url_app]/#/lostPass/[id_user]/[key]'>[url_app]/#/lostPass/[id_user]/[key]</a><br>Cordialement,<br>L'équipe VonaDrive.<br><br>Ce mail a été généré automatiquement, merci de ne pas y répondre.",
    "notFound": "Erreur\u00a0: Utilisateur non trouvé\u00a0!",
    "reset": "Attention\u00a0! Si vous changez votre phrase secrète, votre compte sera réinitialisé et vous perdrez vos données\u00a0!",
    "resetData": "Réinitialiser mes données\u00a0?",
    "subject": "VonaDrive - Mot de passe oublié",
    "updateErr": "Impossible de mettre à jour vos informations.",
    "updateOk": "Vos informations ont bien été mises à jour.",
    "user": "Votre adresse email ou nom d'utilisateur",
    "wait": "Veuillez patienter une minute avant de demander à nouveau un mail de mot de passe oublié."
  },

  "Profile": {
    "2fa_0": "Désactivé",
    "2fa_1": "Par email",
    "2fa_2": "Google Authenticator",
    "accountDeletionConfirm": "Voulez-vous vraiment supprimer votre compte\u00a0?",
    "badOldPass": "Votre ancien mot de passe ne correspond pas",
    "badOldPassphrase": "Votre ancienne phrase secrète ne correspond pas",
    "changeLogin": "Modifier votre nom d'utilisateur",
    "changeMail": "Changement d'email",
    "changePp": "Modifier votre phrase secrète",
    "changePwd": "Modifier votre mot de passe",
    "currentPassword": "Entrer votre mot de passe actuel",
    "deleteAccount": "Supprimer votre compte",
    "deleteWarning": "Avertissement: Tout abonnement premium ne sera plus valable si vous supprimez votre compte.",
    "doubleAuth": "Double authentification",
    "getMore": "Obtenir plus de stockage",
    "iwant": "Je le veux vraiment",
    "lang": "Langue",
    "loginExists": "Ce nom d'utilisateur est déjà utilisé",
    "mailExists": "Cette adresse email address est déjà prise.",
    "mailFormat": "Le format de l'email est invalide.",
    "mailUsername": "Email & Nom d'utilisateur",
    "newLogin": "Nouveau nom d'utilisateur",
    "newPp": "Nouvelle phrase secrète",
    "newPwd": "Nouveau mot de passe",
    "oldPp": "Ancienne phrase secrète",
    "oldPwd": "Ancien mot de passe",
    "otherOptions": "Autres options",
    "pwdPp": "Mot de passe & Phrase secrète",
    "samePassword": "Vous devez utiliser un mot de passe différent",
    "sessions": "Sessions",
    "switchToOnePassword": "Passer en mode One-Password",
    "switchToTwoPassword": "Passer en mode Two-Password",
    "terminate": "Fermer",
    "terminateAll": "Fermer toutes les autres sessions",
    "theme": "Thème",
    "updateErr": "Impossible de mettre à jour vos informations",
    "updateOk": "Vos informations ont bien été mises à jour",
    "upgrade": "Prêt à mettre votre compte à niveau\u00a0?"
  },

  "Register": {
    "alreadyRegistered": "Déjà inscrit\u00a0?",
    "badPassConfirm": "Les deux mots de passe sont différents.",
    "badPassphraseConfirm": "Les deux phrase secrètes sont différentes.",
    "confirm": "Confirmez",
    "create": "Créer maintenant.",
    "dontHaveAccount": "Pas de compte VonaDrive\u00a0?",
    "doubleAuth": "Activer",
    "email": "Adresse email",
    "error": "Une erreur est survenue lors de la création du compte.",
    "form": "Tous les champs doivent être remplis.",
    "impossible": "Inscriptions impossibles pour le moment",
    "login": "Nom d'utilisateur",
    "loginExists": "Votre nom d'utilisateur est déjà enregistré dans la base de données. Impossible de recréer un compte à partir de celui-ci.",
    "loginFormat": "Le format du pseudo est incorrect (entre 2 et 20 caractères alphanumérique, -_. autorisés).",
    "mailExists": "Votre adresse email est déjà enregistrée dans la base de données. Impossible de recréer un compte à partir de celle-ci.",
    "mailFormat": "Le format de l'adresse email est incorrect.",
    "ok": "Inscription effectuée avec succès\u00a0!",
    "passEqualPassphrase": "Le mot de passe et la phrase secrète doivent être différents.",
    "passLength": "Le mot de passe ou la phrase secrète doit faire au minimum 6 caractères.",
    "passphrase": "Phrase secrète",
    "passphraseHelp": "Mot de passe utilisé pour chiffrer et déchiffrer les fichiers",
    "password": "Mot de passe",
    "useOnePassword": "Utiliser le mode One-Password\u00a0?"
  },

  "Rm": {
    "questiond": "Voulez vous supprimer ce dossier\u00a0?",
    "questionf": "Voulez vous supprimer ce fichier\u00a0?",
    "questionrm": "Voulez vous supprimer ce(s) fichier(s)/dossier(s)\u00a0?"
  },

  "Selection": {
    "actions": "Actions",
    "copy": "Copier",
    "copyLink": "Copier le lien",
    "cut": "Couper",
    "dl": "Télécharger",
    "file": "Fichier",
    "folder": "Dossier",
    "logOut": "Se déconnecter",
    "mvItem": "Renommer",
    "mvLocate": "Déplacer vers...",
    "new": "Nouveau",
    "nFolder": "Nouveau dossier",
    "open": "Ouvrir",
    "paste": "Coller",
    "quotaOf": "[used] sur [total]",
    "restore": "Restaurer",
    "rm": "Supprimer",
    "share": "Partager",
    "star": "Favori",
    "trash": "Corbeille",
    "unshare": "Arrêter le partage",
    "upFiles": "Charger des fichiers",
    "upFolder": "Charger un dossier",
    "vDetails": "Voir les détails"
  },

  "Sidebar": {
    "bug": "Bug",
    "help": "Aide",
    "settings": "Options"
  },

  "Story": {
    "donate": "Faire un don",
    "help": "How does my support help?",
    "join": "Rejoignez notre aventure, gardons VonaDrive libre, sécurisé, et open source pour tout le monde.",
    "keep": "Gardons VonaDrive <u>Libre</u> et <u>Open Source</u>.",
    "premium": "Go Premium",
    "read": "Read Our Story"
  },

  "Transfers": {
    "replaceFile": "Le fichier [filename] existe, voulez-vous le remplacer\u00a0?",
    "replaceCompleteFile": "Le fichier [filename] existe et il n'est pas complet, que voulez-vous faire\u00a0?",
    "quotaExceeded": "Quota dépassé\u00a0!",
    "fileAPI": "Les APIs File ne sont pas totalement supportées par votre navigateur.",
    "yes": "Oui",
    "no": "Non",
    "yesAll": "Oui pour tous",
    "noAll": "Non pour tous",
    "complete": "Compléter",
    "replace": "Remplacer",
    "nothing": "Rien du tout...",
    "uploading": "Envois",
    "downloading": "Téléchargements"
  },

  "Tree": {
    "copied": "Le lien a été copié dans le presse-papier",
    "details": "Détails",
    "dlNothing": "Vous n'avez encore rien téléchargé",
    "element": "élément",
    "elements": "éléments",
    "fileSelected": "fichier(s) sélectionné(s)",
    "first": "Téléversez votre premier fichier.",
    "foldername": "Nom du dossier",
    "folderSelected": "dossier(s) sélectionné(s)",
    "generateLink": "Générer le lien",
    "lastmod": "Dernière modification",
    "multiSelection": "Sélection multiple",
    "name": "Nom",
    "needHelp": "Besoin d'aide pour commencer ?",
    "notCompleted": "Incomplet",
    "options": "Options",
    "path": "Emplacement",
    "selectAll": "Sélectionner tout",
    "shared": "Partage du fichier activé",
    "size": "Taille",
    "trashNothing": "Vous n'avez supprimé aucun fichier récemment.",
    "type": "Type de fichier",
    "uploaded": "Modifié",
    "uploadedBy": "Téléversé par [login] le",
    "upNothing": "Vous n'avez encore rien téléversé"
  },

  "Units": {
    "o": "",
    "k": "Ko",
    "m": "Mo",
    "g": "Go",
    "t": "To"
  },

  "Upgrade": {
    "duration": "Durée",
    "endDate": "Date de fin",
    "expired": "Expiré",
    "history": "Historique de paiement",
    "lifetime": "à vie",
    "month": "mois",
    "months": "mois",
    "mostPopular": "Le plus populaire",
    "mue": "Obtenez 30% de réduction en payant avec <u>Monetary Unit (MUE)</u>.",
    "offers": "Offres",
    "price": "Prix",
    "startDate": "Date de début",
    "successMsg": "Votre achat a bien été effectué. Cela peut prendre plusieurs minutes pour actualiser votre espace disque.",
    "upgradeMui": "Mettre VonaDrive à niveau",
    "year": "an",
    "years": "ans"
  },

  "Validate": {
    "done": "Votre compte est validé. Vous pouvez vous connecter et démarrer avec VonaDrive\u00a0!",
    "keyErr": "Erreur\u00a0: La clé de validation est incorrecte, connectez-vous pour envoyer un nouveau mail de validation",
    "message": "Bienvenue sur VonaDrive&nbsp;!<br>Afin de valider votre compte, suivez ce lien&nbsp;: <a href='[url_app]/#/validate/[id_user]/[key]'>[url_app]/#/validate/[id_user]/[key]</a><br>Cordialement,<br>L'équipe VonaDrive<br><br>Ce mail a été généré automatiquement, merci de ne pas y répondre.",
    "sendmail": "Envoyer un nouvel email",
    "sendmess": "Suivez le lien donné dans l'email pour activer votre compte",
    "subject": "VonaDrive - Validez votre compte",
    "wait": "Veuillez patienter une minute avant d'envoyer un nouveau mail de validation."
  }
}
