{
  "Bug": {
    "browser": "Browser",
    "browserVersion": "Versione del browser",
    "form": "Errore nel form",
    "message": "Messaggio",
    "messageLength": "Il messaggio deve essere di almeno 50 caratteri",
    "os": "Sistema operativo",
    "send": "Send report",
    "sent": "Il tuo messaggio è stato inviato con successo. Ti risponderemo via mail il prima possibile.",
    "wait": "Please wait a minute before sending a new bug report."
  },

  "Dates": {
    "date": "DD/MM/YYYY",
    "time": "HH:mm"
  },

  "EndSubscriptionMail": {
    "subject": "VonaDrive - Your subscription ends in less than [days] days",
    "message": "Hi [login],<br>This email is sent because your subscription ends in less than [days] days.<br>VonaDrive Team"
  },

  "InactiveUserMail": {
    "subject": "VonaDrive - You are inactive",
    "message": "Hi [login],<br>This email is sent because you are inactive for [inactiveDays] days.<br>Your account will be deleted in [deleteDelay] days if you don't log in<br>VonaDrive Team"
  },

  "Error": {
    "bannedSession": "Hai raggiunto il numero massimo di richieste consentite",
    "default": "É stato riscontrato un errore",
    "dl": "The file downloading feature is not available in your browser.",
    "e404": "Errore: pagina non trovata",
    "form": "Errore nel form",
    "pp": "La modifica della frase di sicurezza al momento non è disponibile"
  },

  "Global": {
    "back": "Torna a VonaDrive",
    "bug": "Bug report",
    "cancel": "Cancel",
    "favorites": "Preferiti",
    "home": "Home",
    "loading": "Caricamento...",
    "login": "Login",
    "logout": "Logout",
    "mailSent": "Ti è stata inviata una mail, per favore controlla la tua casella di posta e lo spam. Se dopo 5 minuti non hai ricevuto nulla, riprova:",
    "profile": "Profilo",
    "recents": "Recenti",
    "refresh": "Aggiorna",
    "register": "Registrati",
    "shared": "Condivisi",
    "sharing": "Condivisione",
    "submit": "Invia",
    "transfers": "Trasferimenti",
    "trash": "Cestino",
    "upgrade": "Upgrade",
    "validate": "Convalida email"
  },

  "Help": {
    "shortcuts": [
      "<strong>Desktop version</strong><ul>",
      "<li>Left click on a file/folder: Select a file/folder - View details</li>",
      "<li>Left click somewhere else: Remove selection</li>",
      "<li>Ctrl + Left click: Select multiple files</li>",
      "<li>Right click: Show actions</li>",
      "<li>Arrow up: Select previous file</li>",
      "<li>Arrow down: Select next file</li>",
      "<li>Ctrl + Arrow up: Add previous file to selection</li>",
      "<li>Ctrl + Arrow down: Add next file to selection</li>",
      "<li>Ctrl + A: Select all</li>",
      "<li>Ctrl + C: Copy</li>",
      "<li>Ctrl + D: Logout</li>",
      "<li>Ctrl + I: Invert selection</li>",
      "<li>Ctrl + R: Move to trash</li>",
      "<li>Ctrl + S: Save selection</li>",
      "<li>Ctrl + V: Paste</li>",
      "<li>Ctrl + X: Cut</li>",
      "<li>Backspace: Go to parent folder</li>",
      "<li>Delete: Delete selection</li>",
      "<li>Esc: Hide actions box</li>",
      "<li>Enter (on a file): Download</li>",
      "<li>Enter (on a folder): Open folder</li>",
      "<li>F1: Help</li></ul>"
    ]
  },

  "Login": {
    "backupCodes": "Backup codes:",
    "badPass": "Bad password!",
    "badPassphrase": "Error: bad passphrase",
    "code": "Codice ricevuto",
    "doubleAuthMessage": "Ciao, il tuo codice di autenticazione è [key]<br>Cordiali saluti,<br>il Team VonaDrive<br><br>Questa mail è stata generata automaticamente, si prega di non rispondere.",
    "enterCodeEnable": "Once scanned, in order to enable Google Authenticator on VonaDrive, you need to enter the 6-digit verification code:",
    "enterCodePerform": "In order to perform this action, you need to enter the 6-digit verification code:",
    "forgot": "Dimenticato la password?",
    "insecureHttp": "You cannot use a server API from HTTP when the client has been loaded with HTTPS",
    "invalidCode": "Il codice inserito non è valido",
    "manually": "Or input code manually:",
    "regenerate": "Regenerate",
    "register": "Non sei ancora registrato?",
    "scan": "Install <strong>Google Authenticator</strong> on your phone and scan this QR Code to get the auth code:",
    "showBackupCodes": "Show backup codes",
    "signIn": "Login",
    "success": "Successfully logged in",
    "username": "Email o login",
    "wait": "Please wait a minute before requesting again a 2-factor authentication mail.",
    "server": "Connect to another server"
  },

  "LostPass": {
    "changePassword": "Warning: if you change your password, you will lose all your data stored on VonaDrive!",
    "changeSecret": "Warning: if you change your secret password, you will lose all your data stored on VonaDrive!",
    "keyErr": "Errore: The la chiave di convalida è errata o scaduta, ti chiediamo di effettuare una nuova richiesta.",
    "losePassword": "Warning: if you lose your password, you will lose all your data stored on VonaDrive!",
    "loseSecret": "Warning: if you lose your secret password, you will lose all your data stored on VonaDrive!",
    "message": "Hi,<br>Per aggiornare la tua password o la frase di sicurezza, segui questo link: <a href='[url_app]/#/lostPass/[id_user]/[key]'>[url_app]/#/lostPass/[id_user]/[key]</a><br>Cordiali saluti,<br>il Team VonaDrive.<br><br>Questa mail è stata generata automaticamente, si prega di non rispondere.",
    "notFound": "Error: User not found!",
    "reset": "Attenzione! Se cambi la tua frase di sicurezza, il tuo account sarà azzerato e perderai tutti i tuoi dati!",
    "resetData": "Reset my data?",
    "subject": "VonaDrive - Password dimenticata",
    "updateErr": "Impossibile aggiornare le tue informazioni account.",
    "updateOk": "Le tue informazioni account sono state aggiornate con successo.",
    "user": "La tua email o il tuo username",
    "wait": "Please wait a minute before requesting again a lost pass mail."
  },

  "Profile": {
    "2fa_0": "Disabled",
    "2fa_1": "By e-mail",
    "2fa_2": "Google Authenticator",
    "accountDeletionConfirm": "Do you really want to delete your account?",
    "badOldPass": "La tua vecchia password non corrisponde",
    "badOldPassphrase": "La tua vecchia frase di sicurezza non corrisponde",
    "changeLogin": "Cambia il mio username",
    "changeMail": "Change Email",
    "changePp": "Cambia la mia frase di sicurezza",
    "changePwd": "Cambia la mia password",
    "currentPassword": "Enter your current password",
    "deleteAccount": "Delete account",
    "deleteWarning": "Warning: Any premium subscription will no longer last if you discard your account.",
    "doubleAuth": "Doppia autenticazione",
    "getMore": "Get more storage",
    "iwant": "I really want to",
    "lang": "Language",
    "loginExists": "Questo username è già in uso",
    "mailExists": "This email address is already taken.",
    "mailFormat": "Mail format is incorrect.",
    "mailUsername": "Email & Username",
    "newLogin": "Nuovo username",
    "newPp": "Nuova frase di sicurezza",
    "newPwd": "Nuova password",
    "oldPp": "Vecchia frase di sicurezza",
    "oldPwd": "Vecchia password",
    "otherOptions": "Other options",
    "pwdPp": "Password & Secret Password",
    "samePassword": "You must use a different password",
    "sessions": "Sessions",
    "switchToOnePassword": "Switch to One-Password mode",
    "switchToTwoPassword": "Switch to Two-Password mode",
    "terminate": "Terminate",
    "terminateAll": "Terminate all other sessions",
    "theme": "Theme",
    "updateErr": "Aggiornamento del tuo profilo fallito",
    "updateOk": "Il tuo profilo è stato aggiornato con successo",
    "upgrade": "Ready to upgrade VonaDrive?"
  },

  "Register": {
    "alreadyRegistered": "Già registrato?",
    "badPassConfirm": "Le password non corrispondono.",
    "badPassphraseConfirm": "Le frasi di sicurezza non corrispondono.",
    "confirm": "Conferma",
    "create": "Create one now.",
    "dontHaveAccount": "Don't have a VonaDrive account?",
    "doubleAuth": "Abilita",
    "email": "Indirizzo email",
    "error": "Errore durante la creazione dell'account.",
    "form": "Tutti i campi devono essere compilati.",
    "impossible": "Registrazione impossibile al momento",
    "login": "Username",
    "loginExists": "Il tuo username è già presente nel nostro database. Impossibile creare un account con questo username.",
    "loginFormat": "Il formato dello username non è corretto (tra 2 e 20 caratteri alfanumerici, -_. consentiti).",
    "mailExists": "Il tuo indirizzo mail è già presente nel nostro database. Impossibile creare un account con questo indirizzo.",
    "mailFormat": "Il formato email non è corretto.",
    "ok": "Registrazione completata!",
    "passEqualPassphrase": "La password e la frase di sicurezza devono essere diverse.",
    "passLength": "La password o la frase di sicurezza deve essere di almeno 6 caratteri.",
    "passphrase": "Frase di sicurezza",
    "passphraseHelp": "Password used for encrypting and decrypting files",
    "password": "Password",
    "useOnePassword": "Use One-Password?"
  },

  "Rm": {
    "questiond": "Desideri rimuovere questa cartella?",
    "questionf": "Desideri rimuovere questo file?",
    "questionrm": "Desideri rimuovere questi files/cartelle?"
  },

  "Selection": {
    "actions": "Actions",
    "copy": "Copia",
    "copyLink": "Copy link",
    "cut": "Taglia",
    "dl": "Download",
    "file": "File",
    "folder": "Folder",
    "logOut": "Log out",
    "mvItem": "Renomina",
    "mvLocate": "Sposta in...",
    "new": "New",
    "nFolder": "Nuova cartella",
    "open": "Apri",
    "paste": "Incolla",
    "quotaOf": "[used] of [total]",
    "restore": "Ripristina",
    "rm": "Cancella",
    "share": "Share",
    "star": "Star",
    "trash": "Cestino",
    "unshare": "Stop sharing",
    "upFiles": "Carica files",
    "upFolder": "Upload a folder",
    "vDetails": "Visualizza dettalgi"
  },

  "Sidebar": {
    "bug": "Bug",
    "help": "Aiuto",
    "settings": "Impostazioni"
  },

  "Story": {
    "donate": "Give a donation",
    "help": "How does my support help?",
    "join": "Join our journey of keeping VonaDrive free, secure, and open source for everyone.",
    "keep": "Keep VonaDrive <u>Free</u> and <u>Open</u>.",
    "premium": "Go Premium",
    "read": "Read Our Story"
  },

  "Transfers": {
    "replaceFile": "The file [filename] exists, do you want to replace it?",
    "replaceCompleteFile": "The file [filename] exists and is not completed, what do you want to do?",
    "quotaExceeded": "Quota exceeded!",
    "fileAPI": "The File APIs are not fully supported by your browser. Fallback required.",
    "yes": "Sì",
    "no": "No",
    "yesAll": "Sì per tutti",
    "noAll": "No per tutti",
    "complete": "Complete",
    "replace": "Replace",
    "nothing": "Nothing...",
    "uploading": "Uploading",
    "downloading": "Downloading"
  },

  "Tree": {
    "copied": "Link has been copied to clipboard",
    "details": "Details",
    "dlNothing": "You haven't downloaded anything yet.",
    "element": "element",
    "elements": "elements",
    "fileSelected": "file(s) selected",
    "first": "Upload your first file.",
    "foldername": "Nome cartella",
    "folderSelected": "folder(s) selected",
    "generateLink": "Generate Link",
    "lastmod": "Ultima modifica",
    "multiSelection": "Multi-selection",
    "name": "Name",
    "needHelp": "Need help getting started with VonaDrive?",
    "notCompleted": "Not completed",
    "options": "Options",
    "path": "Percorso",
    "selectAll": "Select all",
    "shared": "File sharing enabled",
    "size": "Size",
    "trashNothing": "You haven't deleted any files recently.",
    "type": "File type",
    "uploaded": "Uploaded",
    "uploadedBy": "Uploaded by [login] on",
    "upNothing": "You haven't uploaded anything yet."
  },

  "Units": {
    "o": "",
    "k": "KB",
    "m": "MB",
    "g": "GB",
    "t": "TB"
  },

  "Upgrade": {
    "duration": "Duration",
    "endDate": "End date",
    "expired": "Expired",
    "history": "Paiement History",
    "lifetime": "lifetime",
    "month": "month",
    "months": "months",
    "mostPopular": "Most Popular",
    "mue": "Get 30% off when you pay with <u>Monetary Unit (MUE)</u>.",
    "offers": "Offers",
    "price": "Price",
    "startDate": "Start date",
    "successMsg": "Your purchase has been made. It may take several minutes to refresh your disk space.",
    "upgradeMui": "Upgrade VonaDrive",
    "year": "year",
    "years": "years"
  },

  "Validate": {
    "done": "Your account is validated. You can now log in and start using VonaDrive!",
    "keyErr": "Errore: la chiave di convalida è errata, effettua il login per inviare una nuova mail di convalida",
    "message": "Benvenuto in VonaDrive!<br>Per convalidare il tuo account, segui questo link: <a href='[url_app]/#/validate/[id_user]/[key]'>[url_app]/#/validate/[id_user]/[key]</a><br>Cordiali saluti,<br>il Team VonaDrive<br><br>Questa mail è stata generata automaticamente, si prega di non rispondere.",
    "sendmail": "Invia una nuova mail",
    "sendmess": "Segui il link nella mail per attivare il tuo account",
    "subject": "VonaDrive - Validazione account",
    "wait": "Ti preghiamo di attendere un minuto prima di inviare una nuova mail di convalida."
  }
}
