{
    "active": false,
    "child_frame_id": "p1378_210",
    "parent_frame_id": "world",
    "transform": {
        "translation": {
            "x": 50.0671377,
            "y": 5.99665751,
            "z": 4.78815161
        },
        "rotation": {
            "x": -0.012401599723320132,
            "y": 0.9998983776229271,
            "z": 0.006402699855145855,
            "w": -0.002905199804923455
        }
    }
}