{
    "active": false,
    "child_frame_id": "p1378_204",
    "parent_frame_id": "world",
    "transform": {
        "translation": {
            "x": 38.83282667,
            "y": 5.97633412,
            "z": 4.76260009
        },
        "rotation": {
            "x": 0.71561789321838,
            "y": -0.692244893663383,
            "z": -0.06796080058251076,
            "w": 0.0637915970217681
        }
    }
}