{
    "active": false,
    "child_frame_id": "waypoint_1",
    "parent_frame_id": "world",
    "transform": {
        "translation": {
            "x": 2.0,
            "y": 2.0,
            "z": 0.0
        },
        "rotation": {
            "x": 0.0,
            "y": 0.0,
            "z": 0.0,
            "w": 1.0
        }
    },
    "zone": 1.0,
    "next": ["waypoint_2"]
}
