{
    "child_frame_id": "post_target_10",
    "parent_frame_id": "world",
    "transform": {
        "translation": {
            "x": 20.0,
            "y": 4.0,
            "z": 0.0
        },
        "rotation": {
            "x": 0.0,
            "y": 0.0,
            "z": 0.0,
            "w": 1.0
        }
    },
    "extra_data": {
        "active": false,
        "zone": 0.5,
        "next": ["wp_back_4"],
        "frame_type": "waypoint"
    }
}