{
    "child_frame_id": "p1378_196",
    "parent_frame_id": "world",
    "transform": {
        "translation": {
            "x": 24.9943268,
            "y": 5.91314287,
            "z": 4.81497765
        },
        "rotation": {
            "x": -0.011790899856647372,
            "y": 0.999652088235104,
            "z": 0.021688899747434758,
            "w": 0.009288099671896392
        }
    },
    "extra_data": {
        "active": false
    }
}