{
    "child_frame_id": "wp_out_2",
    "parent_frame_id": "world",
    "transform": {
        "translation": {
            "x": 13.5,
            "y": 7.2,
            "z": 0.0
        },
        "rotation": {
            "x": 0.0,
            "y": 0.0,
            "z": 0.0,
            "w": 1.0
        }
    },
    "extra_data": {
        "active": false,
        "zone": 0.5,
        "next": ["wp_out_1", "wp_out_3"],
        "frame_type": "waypoint"
    }
}
