<svg viewBox="0 0 18 25" xmlns="http://www.w3.org/2000/svg">
    <path d="M1.25694 13.1856L15.1098 24.7296C15.5684 25.0987 16.2991 25.0881 16.7421 24.7059C17.1741 24.3331 17.1741 23.7421 16.7421 23.3693L3.7054 12.5055L16.7421 1.64158C17.1928 1.26595 17.1928 0.656952 16.7421 0.281321C16.2912 -0.0942535 15.5605 -0.0942535 15.1098 0.281321L1.25694 11.8253C0.80625 12.201 0.80625 12.81 1.25694 13.1856Z"/>
</svg>
