<svg viewBox="0 0 135 27" fill="none" xmlns="http://www.w3.org/2000/svg">
  <g clip-path="url(#clip0)">
    <path class="primary" d="M35.1657 4.06421V0.326843H20.7837V4.06421H24.9375H35.1657Z" fill="#2A2E5B"/>
    <path class="primary" d="M24.9375 11.6668H33.9423V7.92944H20.7837V19.4115H35.3079V15.6742H24.9375V11.6668Z" fill="#2A2E5B"/>
    <path class="primary" d="M54.37 0.326843H38.5513V4.06421H54.37V0.326843Z" fill="#2A2E5B"/>
    <path class="primary" d="M48.5657 7.92944H44.3691V19.3973H48.5657V7.92944Z" fill="#2A2E5B"/>
    <path class="primary" d="M83.4182 0.326843H79.2217V4.06421H83.4182V0.326843Z" fill="#2A2E5B"/>
    <path class="primary" d="M103.59 11.6668H112.595V7.92944H99.436V19.4115H113.96V15.6742H103.59V11.6668Z" fill="#2A2E5B"/>
    <path class="primary" d="M17.4262 7.92947C17.2982 7.27579 17.1133 6.66474 16.8714 6.06789C16.5585 5.34316 16.1602 4.67526 15.6765 4.06421C15.4062 3.70895 15.1075 3.3679 14.7803 3.05526C13.8699 2.20263 12.803 1.53474 11.5511 1.05158C10.3135 0.568422 8.93361 0.326843 7.45416 0.326843H0V4.06421L4.19652 4.12105H7.43994C8.29347 4.12105 9.07587 4.26316 9.78714 4.54737C10.4984 4.83158 11.0959 5.22947 11.608 5.72684C12.1059 6.23842 12.5042 6.84947 12.7887 7.56C12.8314 7.67368 12.8741 7.80158 12.9168 7.92947C13.1017 8.52632 13.2013 9.18 13.2013 9.86211V9.91895C13.2013 10.7716 13.059 11.5532 12.7745 12.2353C12.5042 12.9316 12.1059 13.5284 11.608 14.04C11.1101 14.5516 10.4984 14.9353 9.78714 15.2053C9.07587 15.4753 8.29347 15.6174 7.43994 15.6174H4.19652V7.92947H0V19.3974H7.45416C8.94784 19.3974 10.3135 19.1558 11.5653 18.6584C12.8172 18.1753 13.8841 17.4932 14.7803 16.6405C15.6765 15.7879 16.3736 14.7789 16.8714 13.6137C17.3693 12.4484 17.6112 11.1979 17.6112 9.84789V9.80526C17.5969 9.16579 17.54 8.54053 17.4262 7.92947Z" fill="#2A2E5B"/>
    <path class="primary" d="M66.0915 3.86523C65.5509 3.86523 65.053 3.93629 64.5693 4.04997H67.5709C67.1015 3.93629 66.6036 3.86523 66.0915 3.86523Z" fill="#2A2E5B"/>
    <path class="primary" d="M76.092 7.92947C75.9639 7.26158 75.779 6.60789 75.5087 5.98263C75.21 5.28632 74.8401 4.64684 74.4134 4.06421C74.1146 3.65211 73.7732 3.24 73.4033 2.88474C72.5071 2.00368 71.4402 1.30737 70.2026 0.781579C68.9792 0.255789 67.6136 0 66.1483 0C64.6689 0 63.3175 0.255789 62.0656 0.781579C60.8138 1.29316 59.7469 2.00368 58.8507 2.91316C58.495 3.26842 58.1678 3.66632 57.8691 4.06421H64.5693C65.0388 3.93632 65.5509 3.87947 66.0914 3.87947C66.6178 3.87947 67.1015 3.95053 67.5709 4.06421C67.8554 4.13526 68.1399 4.23474 68.4102 4.34842C69.1215 4.66105 69.7332 5.10158 70.2453 5.64158C70.7574 6.18158 71.1699 6.82105 71.4402 7.54579C71.4829 7.67368 71.5256 7.80158 71.5683 7.92947C71.7674 8.54053 71.867 9.19421 71.867 9.86211V9.91895C71.867 10.7432 71.7247 11.5105 71.4402 12.2211C71.1557 12.9458 70.7716 13.5711 70.2737 14.1111C69.7758 14.6511 69.1641 15.0916 68.4529 15.39C67.7416 15.6884 66.9734 15.8589 66.1341 15.8589C65.2806 15.8589 64.4982 15.7026 63.8011 15.3758C63.1041 15.0632 62.4924 14.6226 61.9661 14.0826C61.4539 13.5426 61.0556 12.9032 60.7711 12.1784C60.4866 11.4537 60.3443 10.6863 60.3443 9.86211V9.80526C60.3443 9.15158 60.4439 8.5121 60.6289 7.92947H56.1478C56.034 8.55474 55.9629 9.19421 55.9629 9.86211V9.91895C55.9629 11.2832 56.2189 12.5621 56.7168 13.7558C57.2147 14.9495 57.9118 15.9868 58.8222 16.8537C59.7184 17.7347 60.7853 18.4311 62.0229 18.9568C63.2606 19.4684 64.612 19.7384 66.0914 19.7384C67.5709 19.7384 68.9223 19.4826 70.1742 18.9568C71.426 18.4453 72.4929 17.7347 73.3891 16.8253C74.2853 15.93 74.9966 14.8784 75.5087 13.6847C76.0208 12.4911 76.2769 11.2121 76.2769 9.86211V9.80526C76.2627 9.16579 76.2058 8.54053 76.092 7.92947Z" fill="#2A2E5B"/>
    <path class="primary" d="M88.9377 7.92947L92.6506 4.06421L96.2496 0.326843H91.1711L83.9161 7.92947H79.2217V19.3974H83.4182V13.5711L85.6374 11.2832L91.5552 19.3974H96.6053L88.4683 8.42684L88.9377 7.92947Z" fill="#2A2E5B"/>
    <path class="primary" d="M113.833 0.326843H99.4507V4.06421H113.833V0.326843Z" fill="#2A2E5B"/>
    <path class="primary" d="M122.183 7.92944H118.029V19.3973H122.183V7.92944Z" fill="#2A2E5B"/>
    <path class="primary" d="M130.846 7.92947V12.0647L124.743 4.06421L121.898 0.326843H118.029V4.06421H119.722L122.681 7.92947L131.429 19.4116H135V7.92947H130.846Z" fill="#2A2E5B"/>
    <path class="primary" d="M135 0.326843H130.846V4.06421H135V0.326843Z" fill="#2A2E5B"/>
    <path class="underline" d="M135 23.2769H0V27.0142H135V23.2769Z" fill="#B7A5FF"/>
    <path class="dot" d="M135 23.2769H130.846V27.0142H135V23.2769Z" fill="#2A2E5B"/>
  </g>
  <defs>
    <clipPath id="clip0">
      <rect width="135" height="27" fill="white"/>
    </clipPath>
  </defs>
</svg>
