<svg viewBox="0 0 20 30" xmlns="http://www.w3.org/2000/svg">
    <path class="primary" d="M19.8033 8.54922C19.6657 7.8206 19.4592 7.12111 19.1642 6.45078C18.8102 5.625 18.3481 4.88666 17.8073 4.19689C17.4926 3.79858 17.1583 3.41969 16.7847 3.06023C15.762 2.09845 14.5428 1.35039 13.1268 0.806347C11.7207 0.272021 10.1672 0 8.46608 0H0V4.19689L4.77876 4.25518H8.46608C9.43953 4.25518 10.3245 4.41062 11.1308 4.73122C11.9371 5.05181 12.6254 5.48899 13.1957 6.06218C13.766 6.63536 14.2085 7.31541 14.5329 8.11205C14.5919 8.24806 14.6313 8.39378 14.6804 8.53951C14.8968 9.21956 15.0147 9.93847 15.0147 10.7157V10.774C15.0147 11.7358 14.8574 12.6004 14.5329 13.3776C14.2183 14.1548 13.766 14.8251 13.1957 15.3983C12.6254 15.9715 11.9371 16.4087 11.1308 16.7196C10.3245 17.0304 9.43953 17.1762 8.46608 17.1762H4.77876V8.54922H0V21.4508H8.46608C10.1573 21.4508 11.7207 21.169 13.1367 20.625C14.5526 20.0712 15.7719 19.3232 16.7945 18.3614C17.8171 17.3996 18.6037 16.2727 19.1642 14.9611C19.7247 13.6496 20 12.2409 20 10.7351V10.6768C20 9.93847 19.941 9.22927 19.8033 8.54922Z" fill="#2A2E5B"/>
    <path class="underline" d="M18.7316 25.8031H0V30H18.7316V25.8031Z" fill="#B7A5FF"/>
    <path class="dot" d="M18.7218 25.8031H14.0118V30H18.7218V25.8031Z" fill="#2A2E5B"/>
</svg>
