{
  "Identifier": "TR-UA-0000",
  "Type": "Acceptance",
  "Country": "UA",
  "Version": "1.0.0",
  "SchemaVersion": "1.0.0",
  "Engine": "CERTLOGIC",
  "EngineVersion": "0.7.5",
  "CertificateType": "Test",
  "Description": [
    {
      "lang": "en",
      "desc": "At most one t-event."
    },
    {
      "lang": "ua",
      "desc": "Результат лише одного теста."
    }
  ],
  "ValidFrom": "2021-08-03T00:00:00Z",
  "ValidTo": "2030-06-01T00:00:00Z",
  "AffectedFields": [
    "t.1"
  ],
  "Logic": {
    "!": [
      {
        "var": "payload.t.1"
      }
    ]
  }
}
