{
  "valueSetId": "vaccines-covid-19-names",
  "valueSetDate": "2021-09-29",
  "valueSetValues": {
    "EU/1/20/1528": {
      "display": "Comirnaty",
      "lang": "ua",
      "active": true,
      "system": "https://ec.europa.eu/health/documents/community-register/html/",
      "version": ""
    },
    "EU/1/20/1507": {
      "display": "Spikevax (previously COVID-19 Vaccine Moderna)",
      "lang": "ua",
      "active": true,
      "system": "https://ec.europa.eu/health/documents/community-register/html/",
      "version": ""
    },
    "EU/1/21/1529": {
      "display": "Vaxzevria",
      "lang": "ua",
      "active": true,
      "system": "https://ec.europa.eu/health/documents/community-register/html/",
      "version": ""
    },
    "EU/1/20/1525": {
      "display": "COVID-19 Vaccine Janssen",
      "lang": "ua",
      "active": true,
      "system": "https://ec.europa.eu/health/documents/community-register/html/",
      "version": ""
    },
    "CVnCoV": {
      "display": "CVnCoV",
      "lang": "ua",
      "active": true,
      "system": "http://ec.europa.eu/temp/vaccineproductname",
      "version": "1.0"
    },
    "Sputnik-V": {
      "display": "Sputnik-V",
      "lang": "ua",
      "active": false,
      "system": "http://ec.europa.eu/temp/vaccineproductname",
      "version": "1.0"
    },
    "Convidecia": {
      "display": "Convidecia",
      "lang": "ua",
      "active": true,
      "system": "http://ec.europa.eu/temp/vaccineproductname",
      "version": "1.0"
    },
    "EpiVacCorona": {
      "display": "EpiVacCorona",
      "lang": "ua",
      "active": true,
      "system": "http://ec.europa.eu/temp/vaccineproductname",
      "version": "1.0"
    },
    "BBIBP-CorV": {
      "display": "BBIBP-CorV",
      "lang": "ua",
      "active": true,
      "system": "http://ec.europa.eu/temp/vaccineproductname",
      "version": "1.0"
    },
    "Inactivated-SARS-CoV-2-Vero-Cell": {
      "display": "Inactivated SARS-CoV-2 (Vero Cell)",
      "lang": "ua",
      "active": true,
      "system": "http://ec.europa.eu/temp/vaccineproductname",
      "version": "1.0"
    },
    "CoronaVac": {
      "display": "CoronaVac",
      "lang": "ua",
      "active": true,
      "system": "http://ec.europa.eu/temp/vaccineproductname",
      "version": "1.0"
    },
    "Covaxin": {
      "display": "Covaxin (also known as BBV152 A, B, C)",
      "lang": "ua",
      "active": true,
      "system": "http://ec.europa.eu/temp/vaccineproductname",
      "version": "1.0"
    },
    "Covishield": {
      "display": "Covishield (ChAdOx1_nCoV-19)",
      "lang": "ua",
      "active": true,
      "system": "http://ec.europa.eu/temp/vaccineproductname",
      "version": "1.2"
    },
    "Covid-19-recombinant": {
      "display": "Covid-19 (recombinant)",
      "lang": "ua",
      "active": true,
      "system": "http://ec.europa.eu/temp/vaccineproductname",
      "version": "1.3"
    },
    "R-COVI": {
      "display": "R-COVI",
      "lang": "ua",
      "active": true,
      "system": "http://ec.europa.eu/temp/vaccineproductname",
      "version": "1.3"
    },
    "CoviVac": {
      "display": "CoviVac",
      "lang": "ua",
      "active": true,
      "system": "http://ec.europa.eu/temp/vaccineproductname",
      "version": "1.4"
    },
    "Sputnik-Light": {
      "display": "Sputnik Light",
      "lang": "ua",
      "active": false,
      "system": "http://ec.europa.eu/temp/vaccineproductname",
      "version": "1.4"
    },
    "Hayat-Vax": {
      "display": "Hayat-Vax",
      "lang": "ua",
      "active": true,
      "system": "http://ec.europa.eu/temp/vaccineproductname",
      "version": "1.4"
    }
  }
}
