{
  "Identifier": "VR-UA-0003",
  "Type": "Acceptance",
  "Country": "UA",
  "Version": "1.2.0",
  "SchemaVersion": "1.0.0",
  "Engine": "CERTLOGIC",
  "EngineVersion": "0.7.5",
  "CertificateType": "Vaccination",
  "Description": [
    {
      "lang": "en",
      "desc": "Verification Datetime must be more than 0 days and less than 365 days after the last date of vaccination."
    },
    {
      "lang": "ua",
      "desc": "Verification Datetime має бути більше 0 днів і менше 365 днів після дати останньої дати вакцинації."
    }
  ],
  "ValidFrom": "2021-09-24T00:00:00Z",
  "ValidTo": "2030-06-01T00:00:00Z",
  "AffectedFields": [
    "v.0",
    "v.0.dt",
    "v.0.dn",
    "v.0.sd"
  ]
,
  "Logic": {
    "if": [
      {
        "<": [
          {
            "var": "payload.v.0.dn"
          },
          {
            "var": "payload.v.0.sd"
          }
        ]
      },
      {
        "not-after": [
          {
            "plusTime": [
              {
                "var": "external.validationClock"
              },
              0,
              "day"
            ]
          },
          {
            "plusTime": [
              {
                "var": "payload.v.0.dt"
              },
              120,
              "day"
            ]
          }
        ]
      },
      {
        "not-after": [
          {
            "plusTime": [
              {
                "var": "external.validationClock"
              },
              0,
              "day"
            ]
          },
          {
            "plusTime": [
              {
                "var": "payload.v.0.dt"
              },
              365,
              "day"
            ]
          }
        ]
      }
    ]
  }
}
