{
  "Identifier": "TR-UA-0002",
  "Type": "Acceptance",
  "Country": "UA",
  "Version": "1.0.0",
  "SchemaVersion": "1.0.0",
  "Engine": "CERTLOGIC",
  "EngineVersion": "0.7.5",
  "CertificateType": "Test",
  "Description": [
    {
      "lang": "en",
      "desc": "If the test type is \"RAT\" then the \"test product and manufacturer\" MUST be in the valueset list, if it's NAA return true."
    },
    {
      "lang": "ua",
      "desc": "Якщо типом тесту є \"RAT\" тоді \"test product and manufacturer\" ПОВИННІ бути в списку наборів значень, якщо це ПЛР - повертає true."
    }
  ],
  "ValidFrom": "2021-08-03T00:00:00Z",
  "ValidTo": "2030-06-01T00:00:00Z",
  "AffectedFields": [
    "t.0.ma",
    "t.0.tt"
  ],
  "Logic": {
    "if": [
      {
        "===": [
          {
            "var": "payload.t.0.tt"
          },
          "LP217198-3"
        ]
      },
      {
        "in": [
          {
            "var": "payload.t.0.ma"
          },
          {
            "var": "external.valueSets.covid-19-lab-test-manufacturer-and-name"
          }
        ]
      },
      true
    ]
  }
}
