{
  "Identifier": "VR-UA-0100",
  "Type": "Acceptance",
  "Country": "UA",
  "Version": "1.1.0",
  "SchemaVersion": "1.0.0",
  "Engine": "CERTLOGIC",
  "EngineVersion": "0.7.5",
  "CertificateType": "Vaccination",
  "Description": [
    {
      "lang": "en",
      "desc": "Unvalid selected certificate by urn."
    },
    {
      "lang": "ua",
      "desc": "Заблокувати вказаний сертифіка за унікальним номером."
    }
  ],
  "ValidFrom": "2021-11-25T21:00:00Z",
  "ValidTo": "2030-06-01T00:00:00Z",
  "AffectedFields": [
    "v.0",
    "v.0.ci"
  ],
  "Logic": {
    "if": [
      {
        "in": [
          {
            "var": "payload.v.0.ci"
          },
          [
            "URN:UVCI:01:UA:0E5566930619555B9E2520C4F3889304"
          ]
        ]
      },
      false,
      true
    ]
  }
}
