{
  "Identifier": "VR-UA-0001",
  "Type": "Acceptance",
  "Country": "UA",
  "Version": "1.1.0",
  "SchemaVersion": "1.0.0",
  "Engine": "CERTLOGIC",
  "EngineVersion": "0.7.5",
  "CertificateType": "Vaccination",
  "Description": [
    {
      "lang": "en",
      "desc": "Only vaccines in the allowed valueset that have been approved by the WHO are allowed."
    },
    {
      "lang": "ua",
      "desc": "Дозволені лише вакцини з дозволеного набору значень, затверджені WHO."
    }
  ],
  "ValidFrom": "2021-08-03T00:00:00Z",
  "ValidTo": "2030-06-01T00:00:00Z",
  "AffectedFields": [
    "v.0",
    "v.0.mp"
  ],
  "Logic": {
    "if": [
      {
        "var": "payload.v.0"
      },
      {
        "in": [
          {
            "var": "payload.v.0.mp"
          },
          [
            "EU/1/20/1528",
            "EU/1/20/1507",
            "EU/1/21/1529",
            "EU/1/20/1525",
            "CoronaVac",
            "Convidecia",
            "EpiVacCorona",
            "BBIBP-CorV",
            "Inactivated-SARS-CoV-2-Vero-Cell",
            "Covaxin",
            "Convidecia",
            "Covishield"
          ]
        ]
      },
      true
    ]
  }
}
