module gitlab.com/hectorjsmith/fail2ban-prometheus-exporter

go 1.20

require (
	github.com/alecthomas/kong v0.8.0
	github.com/kisielk/og-rek v1.2.0
	github.com/nlpodyssey/gopickle v0.2.0
	github.com/prometheus/client_golang v1.16.0
)

require (
	github.com/beorn7/perks v1.0.1 // indirect
	github.com/cespare/xxhash/v2 v2.2.0 // indirect
	github.com/golang/protobuf v1.5.3 // indirect
	github.com/matttproud/golang_protobuf_extensions v1.0.4 // indirect
	github.com/prometheus/client_model v0.4.0 // indirect
	github.com/prometheus/common v0.44.0 // indirect
	github.com/prometheus/procfs v0.11.0 // indirect
	golang.org/x/sys v0.9.0 // indirect
	google.golang.org/protobuf v1.31.0 // indirect
)
