{
  "name": "stm32f0xx_hal_driver",
  "version": "1.11.1",
  "description": "The STM32Cube hardware abstraction layer (HAL) and Low Layer APIs (LL) for STM32F0 family with CMSIS library",
  "keywords": "STM32, STM32F0, CMSIS",
  "repository":
  {
    "type": "git",
    "url": "https://gitlab.com/vojtech.vigner/stm32f0xx_hal_driver.git"
  },
  "authors":
  [
    {
      "name": "Vojtech Vigner",
      "email": "vojtech.vigner@gmail.com",
      "url": "https://gitlab.com/vojtech.vigner"
    }
  ],
  "license": "MIT",
  "homepage": "https://gitlab.com/vojtech.vigner/stm32f0xx_hal_driver",
  "dependencies": {},
  "frameworks": "*",
  "platforms": "ststm32",

  "build": {
    "flags": [
      "-I include",
      "-I include/device",
      "-I include/cmsis"
      ]
  }
}
