{
  "name": "Embedded Crypto Library",
  "version": "1.0",
  "description": "Cryptographic library for embedded applications written in C++.",
  "keywords": "Cryptographic",
  "repository":
  {
    "type": "git",
    "url": "https://gitlab.com/vojtech.vigner/ecl.git"
  },
  "authors":
  [
    {
      "name": "Vojtěch Vigner",
      "email": "vojtech.vigner@gmail.com",
      "url": "https://gitlab.com/vojtech.vigner"
    }
  ],
  "homepage": "https://gitlab.com/vojtech.vigner/ecl",
  "dependencies": {},
  "frameworks": "*",
  "platforms": "*",

  "build": {
    "flags": [
      "-I include"
      ]
  }
}
