{
  "d36b8ad5-fadd-445a-b195-e37cc201c8fd": {
    "disable": false,
    "email": "6245384243@student.chula.ac.th",
    "firstname": "Somkid",
    "firstnameth": "\u0e2a\u0e21\u0e04\u0e34\u0e14",
    "gecos": "Somkid Chanveerakul, ENG",
    "lastname": "Chanveerakul",
    "lastnameth": "\u0e0a\u0e32\u0e0d\u0e27\u0e35\u0e23\u0e01\u0e39\u0e25",
    "ouid": "6245384243",
    "roles": ["student"],
    "uid": "696d50cb-de91-4d96-9595-888036a00883",
    "username": "6245384243"
  },
  "bc99b29b-8e53-4a98-8d22-9ef2f972bdda": {
    "disable": false,
    "email": "6224439686@student.chula.ac.th",
    "firstname": "Prayuth",
    "firstnameth": "\u0e1b\u0e23\u0e30\u0e22\u0e38\u0e17\u0e18\u0e4c",
    "gecos": "Prayuth Chanveerakul, ENG",
    "lastname": "Chanveerakul",
    "lastnameth": "\u0e0a\u0e32\u0e0d\u0e27\u0e35\u0e23\u0e01\u0e39\u0e25",
    "ouid": "6224439686",
    "roles": ["student"],
    "uid": "653ff6dc-8c70-496f-9794-edfde6feb9f0",
    "username": "6224439686"
  },
  "6202e215-6a37-44db-b199-b39acf3c2bce": {
    "disable": false,
    "email": "6296518408@student.chula.ac.th",
    "firstname": "Prayuth",
    "firstnameth": "\u0e1b\u0e23\u0e30\u0e22\u0e38\u0e17\u0e18\u0e4c",
    "gecos": "Prayuth Kluengam, ENG",
    "lastname": "Kluengam",
    "lastnameth": "\u0e40\u0e04\u0e23\u0e37\u0e2d\u0e07\u0e32\u0e21",
    "ouid": "6296518408",
    "roles": ["student"],
    "uid": "7de7aa79-ce83-426c-952c-7e16701cff30",
    "username": "6296518408"
  },
  "97b18fc3-76dd-4375-a632-ae354226b208": {
    "disable": false,
    "email": "6262255126@student.chula.ac.th",
    "firstname": "Vishnu",
    "firstnameth": "\u0e27\u0e34\u0e29\u0e13\u0e38",
    "gecos": "Vishnu Jun O Cha, ENG",
    "lastname": "Jun O Cha",
    "lastnameth": "\u0e08\u0e31\u0e19\u0e17\u0e23\u0e4c\u0e42\u0e2d\u0e0a\u0e32",
    "ouid": "6262255126",
    "roles": ["student"],
    "uid": "c08902d5-b3e8-426c-8a6b-c38defdc9d47",
    "username": "6262255126"
  },
  "78134c84-795f-4daf-87eb-041819425e64": {
    "disable": false,
    "email": "6230897043@student.chula.ac.th",
    "firstname": "Anutin",
    "firstnameth": "\u0e2d\u0e19\u0e38\u0e17\u0e34\u0e19",
    "gecos": "Anutin Chanveerakul, ENG",
    "lastname": "Chanveerakul",
    "lastnameth": "\u0e0a\u0e32\u0e0d\u0e27\u0e35\u0e23\u0e01\u0e39\u0e25",
    "ouid": "6230897043",
    "roles": ["student"],
    "uid": "88209068-de60-4b0d-bab2-c4521a25a1f0",
    "username": "6230897043"
  },
  "57d72dc1-88fb-403d-931d-0a71eb54bf65": {
    "disable": false,
    "email": "6265815046@student.chula.ac.th",
    "firstname": "Anupong",
    "firstnameth": "\u0e2d\u0e19\u0e38\u0e1e\u0e07\u0e29\u0e4c",
    "gecos": "Anupong Jatusripitak, ENG",
    "lastname": "Jatusripitak",
    "lastnameth": "\u0e08\u0e32\u0e15\u0e38\u0e28\u0e23\u0e35\u0e1e\u0e34\u0e17\u0e31\u0e01\u0e29\u0e4c",
    "ouid": "6265815046",
    "roles": ["student"],
    "uid": "1c444b20-8ddb-4adc-86b3-952255cb0c0b",
    "username": "6265815046"
  },
  "f4e9c1fe-1c48-4968-ac3b-0fa07e60805e": {
    "disable": false,
    "email": "6205389038@student.chula.ac.th",
    "firstname": "Prayuth",
    "firstnameth": "\u0e1b\u0e23\u0e30\u0e22\u0e38\u0e17\u0e18\u0e4c",
    "gecos": "Prayuth Kluengam, ENG",
    "lastname": "Kluengam",
    "lastnameth": "\u0e40\u0e04\u0e23\u0e37\u0e2d\u0e07\u0e32\u0e21",
    "ouid": "6205389038",
    "roles": ["student"],
    "uid": "bc1dd3dd-5908-4cd1-8957-45f82fab8a3d",
    "username": "6205389038"
  },
  "f4109e91-ca65-4645-8ed2-8c941fd897b2": {
    "disable": false,
    "email": "6296842625@student.chula.ac.th",
    "firstname": "Somkid",
    "firstnameth": "\u0e2a\u0e21\u0e04\u0e34\u0e14",
    "gecos": "Somkid Wongsuwan, ENG",
    "lastname": "Wongsuwan",
    "lastnameth": "\u0e27\u0e07\u0e29\u0e4c\u0e2a\u0e38\u0e27\u0e23\u0e23\u0e13",
    "ouid": "6296842625",
    "roles": ["student"],
    "uid": "51777309-3006-4545-b112-8922338cf2d6",
    "username": "6296842625"
  },
  "fddd228f-503e-4d2a-9951-92fadaa3bc38": {
    "disable": false,
    "email": "6222718965@student.chula.ac.th",
    "firstname": "Somkid",
    "firstnameth": "\u0e2a\u0e21\u0e04\u0e34\u0e14",
    "gecos": "Somkid Kluengam, ENG",
    "lastname": "Kluengam",
    "lastnameth": "\u0e40\u0e04\u0e23\u0e37\u0e2d\u0e07\u0e32\u0e21",
    "ouid": "6222718965",
    "roles": ["student"],
    "uid": "6fc1ab1e-47a0-4554-8ba1-9e3731cc55c5",
    "username": "6222718965"
  },
  "45f8d649-97fa-4c0e-95bf-faa1ec64269c": {
    "disable": false,
    "email": "6283042350@student.chula.ac.th",
    "firstname": "Anutin",
    "firstnameth": "\u0e2d\u0e19\u0e38\u0e17\u0e34\u0e19",
    "gecos": "Anutin Poajinda, ENG",
    "lastname": "Poajinda",
    "lastnameth": "\u0e40\u0e1c\u0e48\u0e32\u0e08\u0e34\u0e19\u0e14\u0e32",
    "ouid": "6283042350",
    "roles": ["student"],
    "uid": "387e3a18-ea34-49bd-9e5c-e65b8d265782",
    "username": "6283042350"
  },
  "daa33294-4e99-45e1-a6df-265748bcb79d": {
    "disable": false,
    "email": "6286150973@student.chula.ac.th",
    "firstname": "Pravith",
    "firstnameth": "\u0e1b\u0e23\u0e30\u0e27\u0e34\u0e15\u0e23",
    "gecos": "Pravith Wongsuwan, ENG",
    "lastname": "Wongsuwan",
    "lastnameth": "\u0e27\u0e07\u0e29\u0e4c\u0e2a\u0e38\u0e27\u0e23\u0e23\u0e13",
    "ouid": "6286150973",
    "roles": ["student"],
    "uid": "ff4d8592-0dee-445e-bb71-2245776fcdf4",
    "username": "6286150973"
  }
}
